{"text_format":"1","workbook":"xlsx","n_sheets":17,"sheets":["ÖZET","ÜYE","YAKIT","PLAN","GELİRLER","GİDER","MENKUL","DEFTER","BANKA","TEDARİKÇİLER","HANE","HAZİRUN","APT","HAZIRLIK","MAKBUZ","GKKARAR","NOTER"],"not_rendered":{"charts":0,"images":4,"macros":1,"external_links":0,"defined_names":7,"comments":1,"pivot_tables":0},"unopened":[],"bounds":{"document_bytes":16777216,"sheet_cells":100000,"rows_first":2000,"rows_last":500,"rows_between":2000,"halvings":0,"cell_chars":16384,"cell_head_chars":4096},"cells_cut":0,"cells_raw":0,"read":"whole","date_system":"1900"}

{"sheet":"ÖZET","index":0,"n_rows":60,"n_cols":136,"rows_kept":60,"cut":false,"hidden":false,"merged":[[5,14,5,21],[0,37,0,44],[0,49,0,56],[0,104,0,111],[0,119,0,130]]}
["GELİR TÜR'Ü","OCAK","ŞUBAT","MART","NİSAN","MAYIS","HAZİRAN","TEMMUZ","AĞUSTOS","EYLÜL","EKİM","KASIM","ARALIK","DEMİRBAŞ",{"$f":"IF(X6<>0,VLOOKUP(X6,ÜYE!A:B,2,FALSE),\"YOK\")","v":"YOK"},null,null,null,null,null,null,{"$f":"+W6","v":2016},{"$f":"X6","v":0},{"$f":"COUNTIF(PLAN!P:P,Y1)","v":0},{"$f":"\"D\"&$W$1&\"-\"&$V$1&\"-\"&$N$1","v":"D0-2016-DEMİRBAŞ"},"KİRA",{"$f":"TODAY()","v":"2016-04-25"},"2016-07-31",{"$f":"+AB1-AA1","v":97},7,null,null,null,{"$f":"+W6","v":2016},{"$f":"+X6","v":0},{"$f":"COUNTIF(PLAN!P:P,AK1)","v":0},{"$f":"\"D\"&$W$1&\"-\"&$V$1&\"-\"&$Z$1","v":"D0-2016-KİRA"},"DİĞER",null,null,null,null,null,null,null,{"$f":"+W6","v":2016},{"$f":"+X6","v":0},{"$f":"COUNTIF(PLAN!P:P,AW1)","v":0},{"$f":"\"D\"&$W$1&\"-\"&$V$1&\"-\"&$AL$1","v":"D0-2016-DİĞER"},"YAKIT",null,null,null,null,null,null,null,{"$f":"+W6","v":2016},{"$f":"+X6","v":0},{"$f":"COUNTIF(PLAN!P:P,BI1)","v":0},{"$f":"\"D\"&$W$1&\"-\"&$V$1&\"-\"&$AX$1","v":"D0-2016-YAKIT"},null,null,null,null,null,null,null,null,null,null,null,"24.04.2016","Şubat2016",{"$f":"+BU1-BV1-30","v":53},7.5,40,{"$f":"(BY1*BX1*BW1)/36000","v":0.44166666666666665},null,null,null,null,null,null,null,null,null,null,null,null,null,null,null,null,null,null,null,null,null,null,null,null,null,null,"Aidat",null,null,null,null,null,null,null,2016,null,null,null,null,null,null,"YAKIT",null,null,null,null,null,null,null,null,null,null,null,null,null,null,null,{"$f":"ÜYE!AA1+2","v":9}]
["AİDAT",{"$f":"+O8","v":100},20,45,{"$f":"+R8","v":0},0,{"$f":"+T8","v":0},0,0,0,0,0,0,"OCAK","ŞUBAT","MART","NİSAN","MAYIS","HAZİRAN","TEMMUZ","AĞUSTOS","EYLÜL","EKİM","KASIM","ARALIK","OCAK","ŞUBAT","MART","NİSAN","MAYIS","HAZİRAN","TEMMUZ","AĞUSTOS","EYLÜL","EKİM","KASIM","ARALIK","OCAK","ŞUBAT","MART","NİSAN","MAYIS","HAZİRAN","TEMMUZ","AĞUSTOS","EYLÜL","EKİM","KASIM","ARALIK","OCAK","ŞUBAT","MART","NİSAN","MAYIS","HAZİRAN","TEMMUZ","AĞUSTOS","EYLÜL","EKİM","KASIM","ARALIK",null,null,null,null,null,null,null,null,null,null,null,"İŞL TARİHİ","AY/YIL","gün","oran","ana para","faiz",null,null,null,null,null,null,null,null,null,null,null,null,null,null,null,null,null,null,null,null,null,null,null,null,null,"NO - ADI SOYADI","OCAK","ŞUBAT","MART","NİSAN","MAYIS","HAZİRAN","TEMMUZ","AĞUSTOS","EYLÜL","EKİM","KASIM","ARALIK",null,null,null,"OCAK","ŞUBAT","MART","NİSAN","MAYIS","HAZİRAN","TEMMUZ","AĞUSTOS","EYLÜL","EKİM","KASIM","ARALIK"]
["TAHSİLAT",{"$f":"+O9","v":0},{"$f":"+P9","v":0},0,0,{"$f":"+S9","v":0},0,0,0,0,0,0,0,{"$f":"IF($X$1>0,SUMIF(PLAN!$P:$P,\"D\"&$W$1&\"-\"&$V$1&\"-\"&$N$1,PLAN!D:D),SUMIF(PLAN!$P:$P,\"D\"&\"-\"&$V$1&\"-\"&$N$1,PLAN!D:D))","v":0},{"$f":"IF($X$1>0,SUMIF(PLAN!$P:$P,\"D\"&$W$1&\"-\"&$V$1&\"-\"&$N$1,PLAN!E:E),SUMIF(PLAN!$P:$P,\"D\"&\"-\"&$V$1&\"-\"&$N$1,PLAN!E:E))","v":0},{"$f":"IF($X$1>0,SUMIF(PLAN!$P:$P,\"D\"&$W$1&\"-\"&$V$1&\"-\"&$N$1,PLAN!F:F),SUMIF(PLAN!$P:$P,\"D\"&\"-\"&$V$1&\"-\"&$N$1,PLAN!F:F))","v":0},{"$f":"IF($X$1>0,SUMIF(PLAN!$P:$P,\"D\"&$W$1&\"-\"&$V$1&\"-\"&$N$1,PLAN!G:G),SUMIF(PLAN!$P:$P,\"D\"&\"-\"&$V$1&\"-\"&$N$1,PLAN!G:G))","v":0},{"$f":"IF($X$1>0,SUMIF(PLAN!$P:$P,\"D\"&$W$1&\"-\"&$V$1&\"-\"&$N$1,PLAN!H:H),SUMIF(PLAN!$P:$P,\"D\"&\"-\"&$V$1&\"-\"&$N$1,PLAN!H:H))","v":0},{"$f":"IF($X$1>0,SUMIF(PLAN!$P:$P,\"D\"&$W$1&\"-\"&$V$1&\"-\"&$N$1,PLAN!I:I),SUMIF(PLAN!$P:$P,\"D\"&\"-\"&$V$1&\"-\"&$N$1,PLAN!I:I))","v":0},{"$f":"IF($X$1>0,SUMIF(PLAN!$P:$P,\"D\"&$W$1&\"-\"&$V$1&\"-\"&$N$1,PLAN!J:J),SUMIF(PLAN!$P:$P,\"D\"&\"-\"&$V$1&\"-\"&$N$1,PLAN!J:J))","v":0},{"$f":"IF($X$1>0,SUMIF(PLAN!$P:$P,\"D\"&$W$1&\"-\"&$V$1&\"-\"&$N$1,PLAN!K:K),SUMIF(PLAN!$P:$P,\"D\"&\"-\"&$V$1&\"-\"&$N$1,PLAN!K:K))","v":0},{"$f":"IF($X$1>0,SUMIF(PLAN!$P:$P,\"D\"&$W$1&\"-\"&$V$1&\"-\"&$N$1,PLAN!L:L),SUMIF(PLAN!$P:$P,\"D\"&\"-\"&$V$1&\"-\"&$N$1,PLAN!L:L))","v":0},{"$f":"IF($X$1>0,SUMIF(PLAN!$P:$P,\"D\"&$W$1&\"-\"&$V$1&\"-\"&$N$1,PLAN!M:M),SUMIF(PLAN!$P:$P,\"D\"&\"-\"&$V$1&\"-\"&$N$1,PLAN!M:M))","v":0},{"$f":"IF($X$1>0,SUMIF(PLAN!$P:$P,\"D\"&$W$1&\"-\"&$V$1&\"-\"&$N$1,PLAN!N:N),SUMIF(PLAN!$P:$P,\"D\"&\"-\"&$V$1&\"-\"&$N$1,PLAN!N:N))","v":0},{"$f":"IF($X$1>0,SUMIF(PLAN!$P:$P,\"D\"&$W$1&\"-\"&$V$1&\"-\"&$N$1,PLAN!O:O),SUMIF(PLAN!$P:$P,\"D\"&\"-\"&$V$1&\"-\"&$N$1,PLAN!O:O))","v":0},{"$f":"IF($AJ$1>0,SUMIF(PLAN!$P:$P,\"D\"&$AI$1&\"-\"&$AH$1&\"-\"&$Z$1,PLAN!D:D),SUMIF(PLAN!$P:$P,\"D\"&\"-\"&$AH$1&\"-\"&$Z$1,PLAN!D:D))","v":0},{"$f":"IF($AJ$1>0,SUMIF(PLAN!$P:$P,\"D\"&$AI$1&\"-\"&$AH$1&\"-\"&$Z$1,PLAN!E:E),SUMIF(PLAN!$P:$P,\"D\"&\"-\"&$AH$1&\"-\"&$Z$1,PLAN!E:E))","v":0},{"$f":"IF($AJ$1>0,SUMIF(PLAN!$P:$P,\"D\"&$AI$1&\"-\"&$AH$1&\"-\"&$Z$1,PLAN!F:F),SUMIF(PLAN!$P:$P,\"D\"&\"-\"&$AH$1&\"-\"&$Z$1,PLAN!F:F))","v":0},{"$f":"IF($AJ$1>0,SUMIF(PLAN!$P:$P,\"D\"&$AI$1&\"-\"&$AH$1&\"-\"&$Z$1,PLAN!G:G),SUMIF(PLAN!$P:$P,\"D\"&\"-\"&$AH$1&\"-\"&$Z$1,PLAN!G:G))","v":0},{"$f":"IF($AJ$1>0,SUMIF(PLAN!$P:$P,\"D\"&$AI$1&\"-\"&$AH$1&\"-\"&$Z$1,PLAN!H:H),SUMIF(PLAN!$P:$P,\"D\"&\"-\"&$AH$1&\"-\"&$Z$1,PLAN!H:H))","v":0},{"$f":"IF($AJ$1>0,SUMIF(PLAN!$P:$P,\"D\"&$AI$1&\"-\"&$AH$1&\"-\"&$Z$1,PLAN!I:I),SUMIF(PLAN!$P:$P,\"D\"&\"-\"&$AH$1&\"-\"&$Z$1,PLAN!I:I))","v":0},{"$f":"IF($AJ$1>0,SUMIF(PLAN!$P:$P,\"D\"&$AI$1&\"-\"&$AH$1&\"-\"&$Z$1,PLAN!J:J),SUMIF(PLAN!$P:$P,\"D\"&\"-\"&$AH$1&\"-\"&$Z$1,PLAN!J:J))","v":0},{"$f":"IF($AJ$1>0,SUMIF(PLAN!$P:$P,\"D\"&$AI$1&\"-\"&$AH$1&\"-\"&$Z$1,PLAN!K:K),SUMIF(PLAN!$P:$P,\"D\"&\"-\"&$AH$1&\"-\"&$Z$1,PLAN!K:K))","v":0},{"$f":"IF($AJ$1>0,SUMIF(PLAN!$P:$P,\"D\"&$AI$1&\"-\"&$AH$1&\"-\"&$Z$1,PLAN!L:L),SUMIF(PLAN!$P:$P,\"D\"&\"-\"&$AH$1&\"-\"&$Z$1,PLAN!L:L))","v":0},{"$f":"IF($AJ$1>0,SUMIF(PLAN!$P:$P,\"D\"&$AI$1&\"-\"&$AH$1&\"-\"&$Z$1,PLAN!M:M),SUMIF(PLAN!$P:$P,\"D\"&\"-\"&$AH$1&\"-\"&$Z$1,PLAN!M:M))","v":0},{"$f":"IF($AJ$1>0,SUMIF(PLAN!$P:$P,\"D\"&$AI$1&\"-\"&$AH$1&\"-\"&$Z$1,PLAN!N:N),SUMIF(PLAN!$P:$P,\"D\"&\"-\"&$AH$1&\"-\"&$Z$1,PLAN!N:N))","v":0},{"$f":"IF($AJ$1>0,SUMIF(PLAN!$P:$P,\"D\"&$AI$1&\"-\"&$AH$1&\"-\"&$Z$1,PLAN!O:O),SUMIF(PLAN!$P:$P,\"D\"&\"-\"&$AH$1&\"-\"&$Z$1,PLAN!O:O))","v":0},{"$f":"IF($AV$1>0,SUMIF(PLAN!$P:$P,\"D\"&$AU$1&\"-\"&$AT$1&\"-\"&$AL$1,PLAN!D:D),SUMIF(PLAN!$P:$P,\"D\"&\"-\"&$AT$1&\"-\"&$AL$1,PLAN!D:D))","v":0},{"$f":"IF($AV$1>0,SUMIF(PLAN!$P:$P,\"D\"&$AU$1&\"-\"&$AT$1&\"-\"&$AL$1,PLAN!E:E),SUMIF(PLAN!$P:$P,\"D\"&\"-\"&$AT$1&\"-\"&$AL$1,PLAN!E:E))","v":0},{"$f":"IF($AV$1>0,SUMIF(PLAN!$P:$P,\"D\"&$AU$1&\"-\"&$AT$1&\"-\"&$AL$1,PLAN!F:F),SUMIF(PLAN!$P:$P,\"D\"&\"-\"&$AT$1&\"-\"&$AL$1,PLAN!F:F))","v":0},{"$f":"IF($AV$1>0,SUMIF(PLAN!$P:$P,\"D\"&$AU$1&\"-\"&$AT$1&\"-\"&$AL$1,PLAN!G:G),SUMIF(PLAN!$P:$P,\"D\"&\"-\"&$AT$1&\"-\"&$AL$1,PLAN!G:G))","v":0},{"$f":"IF($AV$1>0,SUMIF(PLAN!$P:$P,\"D\"&$AU$1&\"-\"&$AT$1&\"-\"&$AL$1,PLAN!H:H),SUMIF(PLAN!$P:$P,\"D\"&\"-\"&$AT$1&\"-\"&$AL$1,PLAN!H:H))","v":0},{"$f":"IF($AV$1>0,SUMIF(PLAN!$P:$P,\"D\"&$AU$1&\"-\"&$AT$1&\"-\"&$AL$1,PLAN!I:I),SUMIF(PLAN!$P:$P,\"D\"&\"-\"&$AT$1&\"-\"&$AL$1,PLAN!I:I))","v":0},{"$f":"IF($AV$1>0,SUMIF(PLAN!$P:$P,\"D\"&$AU$1&\"-\"&$AT$1&\"-\"&$AL$1,PLAN!J:J),SUMIF(PLAN!$P:$P,\"D\"&\"-\"&$AT$1&\"-\"&$AL$1,PLAN!J:J))","v":0},{"$f":"IF($AV$1>0,SUMIF(PLAN!$P:$P,\"D\"&$AU$1&\"-\"&$AT$1&\"-\"&$AL$1,PLAN!K:K),SUMIF(PLAN!$P:$P,\"D\"&\"-\"&$AT$1&\"-\"&$AL$1,PLAN!K:K))","v":0},{"$f":"IF($AV$1>0,SUMIF(PLAN!$P:$P,\"D\"&$AU$1&\"-\"&$AT$1&\"-\"&$AL$1,PLAN!L:L),SUMIF(PLAN!$P:$P,\"D\"&\"-\"&$AT$1&\"-\"&$AL$1,PLAN!L:L))","v":0},{"$f":"IF($AV$1>0,SUMIF(PLAN!$P:$P,\"D\"&$AU$1&\"-\"&$AT$1&\"-\"&$AL$1,PLAN!M:M),SUMIF(PLAN!$P:$P,\"D\"&\"-\"&$AT$1&\"-\"&$AL$1,PLAN!M:M))","v":0},{"$f":"IF($AV$1>0,SUMIF(PLAN!$P:$P,\"D\"&$AU$1&\"-\"&$AT$1&\"-\"&$AL$1,PLAN!N:N),SUMIF(PLAN!$P:$P,\"D\"&\"-\"&$AT$1&\"-\"&$AL$1,PLAN!N:N))","v":0},{"$f":"IF($AV$1>0,SUMIF(PLAN!$P:$P,\"D\"&$AU$1&\"-\"&$AT$1&\"-\"&$AL$1,PLAN!O:O),SUMIF(PLAN!$P:$P,\"D\"&\"-\"&$AT$1&\"-\"&$AL$1,PLAN!O:O))","v":0},{"$f":"SUMIF(YAKIT!$J:$J,\"D\"&$BG$1&\"-\"&AX2&\"-\"&$BF$1&\"-\"&$AX$1,YAKIT!$I:$I)+IF($BH$1>0,SUMIF(PLAN!$P:$P,\"D\"&$BG$1&\"-\"&$BF$1&\"-\"&$AX$1,PLAN!D:D),SUMIF(PLAN!$P:$P,\"D\"&\"-\"&$BF$1&\"-\"&$AX$1,PLAN!D:D))","v":0},{"$f":"SUMIF(YAKIT!$J:$J,\"D\"&$BG$1&\"-\"&AY2&\"-\"&$BF$1&\"-\"&$AX$1,YAKIT!$I:$I)+IF($BH$1>0,SUMIF(PLAN!$P:$P,\"D\"&$BG$1&\"-\"&$BF$1&\"-\"&$AX$1,PLAN!E:E),SUMIF(PLAN!$P:$P,\"D\"&\"-\"&$BF$1&\"-\"&$AX$1,PLAN!E:E))","v":0},{"$f":"SUMIF(YAKIT!$J:$J,\"D\"&$BG$1&\"-\"&AZ2&\"-\"&$BF$1&\"-\"&$AX$1,YAKIT!$I:$I)+IF($BH$1>0,SUMIF(PLAN!$P:$P,\"D\"&$BG$1&\"-\"&$BF$1&\"-\"&$AX$1,PLAN!F:F),SUMIF(PLAN!$P:$P,\"D\"&\"-\"&$BF$1&\"-\"&$AX$1,PLAN!F:F))","v":0},{"$f":"SUMIF(YAKIT!$J:$J,\"D\"&$BG$1&\"-\"&BA2&\"-\"&$BF$1&\"-\"&$AX$1,YAKIT!$I:$I)+IF($BH$1>0,SUMIF(PLAN!$P:$P,\"D\"&$BG$1&\"-\"&$BF$1&\"-\"&$AX$1,PLAN!G:G),SUMIF(PLAN!$P:$P,\"D\"&\"-\"&$BF$1&\"-\"&$AX$1,PLAN!G:G))","v":0},{"$f":"SUMIF(YAKIT!$J:$J,\"D\"&$BG$1&\"-\"&BB2&\"-\"&$BF$1&\"-\"&$AX$1,YAKIT!$I:$I)+IF($BH$1>0,SUMIF(PLAN!$P:$P,\"D\"&$BG$1&\"-\"&$BF$1&\"-\"&$AX$1,PLAN!H:H),SUMIF(PLAN!$P:$P,\"D\"&\"-\"&$BF$1&\"-\"&$AX$1,PLAN!H:H))","v":0},{"$f":"SUMIF(YAKIT!$J:$J,\"D\"&$BG$1&\"-\"&BC2&\"-\"&$BF$1&\"-\"&$AX$1,YAKIT!$I:$I)+IF($BH$1>0,SUMIF(PLAN!$P:$P,\"D\"&$BG$1&\"-\"&$BF$1&\"-\"&$AX$1,PLAN!I:I),SUMIF(PLAN!$P:$P,\"D\"&\"-\"&$BF$1&\"-\"&$AX$1,PLAN!I:I))","v":0},{"$f":"SUMIF(YAKIT!$J:$J,\"D\"&$BG$1&\"-\"&BD2&\"-\"&$BF$1&\"-\"&$AX$1,YAKIT!$I:$I)+IF($BH$1>0,SUMIF(PLAN!$P:$P,\"D\"&$BG$1&\"-\"&$BF$1&\"-\"&$AX$1,PLAN!J:J),SUMIF(PLAN!$P:$P,\"D\"&\"-\"&$BF$1&\"-\"&$AX$1,PLAN!J:J))","v":0},{"$f":"SUMIF(YAKIT!$J:$J,\"D\"&$BG$1&\"-\"&BE2&\"-\"&$BF$1&\"-\"&$AX$1,YAKIT!$I:$I)+IF($BH$1>0,SUMIF(PLAN!$P:$P,\"D\"&$BG$1&\"-\"&$BF$1&\"-\"&$AX$1,PLAN!K:K),SUMIF(PLAN!$P:$P,\"D\"&\"-\"&$BF$1&\"-\"&$AX$1,PLAN!K:K))","v":0},{"$f":"SUMIF(YAKIT!$J:$J,\"D\"&$BG$1&\"-\"&BF2&\"-\"&$BF$1&\"-\"&$AX$1,YAKIT!$I:$I)+IF($BH$1>0,SUMIF(PLAN!$P:$P,\"D\"&$BG$1&\"-\"&$BF$1&\"-\"&$AX$1,PLAN!L:L),SUMIF(PLAN!$P:$P,\"D\"&\"-\"&$BF$1&\"-\"&$AX$1,PLAN!L:L))","v":0},{"$f":"SUMIF(YAKIT!$J:$J,\"D\"&$BG$1&\"-\"&BG2&\"-\"&$BF$1&\"-\"&$AX$1,YAKIT!$I:$I)+IF($BH$1>0,SUMIF(PLAN!$P:$P,\"D\"&$BG$1&\"-\"&$BF$1&\"-\"&$AX$1,PLAN!M:M),SUMIF(PLAN!$P:$P,\"D\"&\"-\"&$BF$1&\"-\"&$AX$1,PLAN!M:M))","v":0},{"$f":"SUMIF(YAKIT!$J:$J,\"D\"&$BG$1&\"-\"&BH2&\"-\"&$BF$1&\"-\"&$AX$1,YAKIT!$I:$I)+IF($BH$1>0,SUMIF(PLAN!$P:$P,\"D\"&$BG$1&\"-\"&$BF$1&\"-\"&$AX$1,PLAN!N:N),SUMIF(PLAN!$P:$P,\"D\"&\"-\"&$BF$1&\"-\"&$AX$1,PLAN!N:N))","v":0},{"$f":"SUMIF(YAKIT!$J:$J,\"D\"&$BG$1&\"-\"&BI2&\"-\"&$BF$1&\"-\"&$AX$1,YAKIT!$I:$I)+IF($BH$1>0,SUMIF(PLAN!$P:$P,\"D\"&$BG$1&\"-\"&$BF$1&\"-\"&$AX$1,PLAN!O:O),SUMIF(PLAN!$P:$P,\"D\"&\"-\"&$BF$1&\"-\"&$AX$1,PLAN!O:O))","v":0},null,null,null,null,null,null,null,null,null,null,null,null,null,null,null,null,null,null,null,null,null,null,null,null,null,null,null,null,null,null,null,null,null,null,null,null,null,null,null,null,null,{"$f":"IF(ÜYE!B2>\"\",ÜYE!A2,\"\")","v":1},{"$f":"IF(ÜYE!B2>\"\",ÜYE!A2&\"-\"&ÜYE!B2,\"\")","v":"1-Tahir"},{"$f":"IF(DN3>0,SUMIF(PLAN!$P:$P,\"D\"&CY3&\"-\"&$DI$1&\"-\"&$DA$1,PLAN!D:D),SUMIF(PLAN!$P:$P,\"D\"&\"-\"&$DI$1&\"-\"&$DA$1,PLAN!D:D))-SUMIF(GELİRLER!$H:$H,\"D\"&CY3&\"-\"&$DA$2&\"-\"&$DI$1&\"-\"&$DA$1,GELİRLER!$G:$G)","v":0},{"$f":"IF(DN3>0,SUMIF(PLAN!$P:$P,\"D\"&CY3&\"-\"&$DI$1&\"-\"&$DA$1,PLAN!E:E),SUMIF(PLAN!$P:$P,\"D\"&\"-\"&$DI$1&\"-\"&$DA$1,PLAN!E:E))-SUMIF(GELİRLER!$H:$H,\"D\"&CY3&\"-\"&$DB$2&\"-\"&$DI$1&\"-\"&$DA$1,GELİRLER!$G:$G)","v":0},{"$f":"IF(DN3>0,SUMIF(PLAN!$P:$P,\"D\"&CY3&\"-\"&$DI$1&\"-\"&$DA$1,PLAN!F:F),SUMIF(PLAN!$P:$P,\"D\"&\"-\"&$DI$1&\"-\"&$DA$1,PLAN!F:F))-SUMIF(GELİRLER!$H:$H,\"D\"&CY3&\"-\"&$DC$2&\"-\"&$DI$1&\"-\"&$DA$1,GELİRLER!$G:$G)","v":0},{"$f":"IF(DN3>0,SUMIF(PLAN!$P:$P,\"D\"&CY3&\"-\"&$DI$1&\"-\"&$DA$1,PLAN!G:G),SUMIF(PLAN!$P:$P,\"D\"&\"-\"&$DI$1&\"-\"&$DA$1,PLAN!G:G))-SUMIF(GELİRLER!$H:$H,\"D\"&CY3&\"-\"&$DD$2&\"-\"&$DI$1&\"-\"&$DA$1,GELİRLER!$G:$G)","v":0},{"$f":"IF(DN3>0,SUMIF(PLAN!$P:$P,\"D\"&CY3&\"-\"&$DI$1&\"-\"&$DA$1,PLAN!H:H),SUMIF(PLAN!$P:$P,\"D\"&\"-\"&$DI$1&\"-\"&$DA$1,PLAN!H:H))-SUMIF(GELİRLER!$H:$H,\"D\"&CY3&\"-\"&$DE$2&\"-\"&$DI$1&\"-\"&$DA$1,GELİRLER!$G:$G)","v":0},{"$f":"IF(DN3>0,SUMIF(PLAN!$P:$P,\"D\"&CY3&\"-\"&$DI$1&\"-\"&$DA$1,PLAN!I:I),SUMIF(PLAN!$P:$P,\"D\"&\"-\"&$DI$1&\"-\"&$DA$1,PLAN!I:I))-SUMIF(GELİRLER!$H:$H,\"D\"&CY3&\"-\"&$DF$2&\"-\"&$DI$1&\"-\"&$DA$1,GELİRLER!$G:$G)","v":0},{"$f":"IF(DN3>0,SUMIF(PLAN!$P:$P,\"D\"&CY3&\"-\"&$DI$1&\"-\"&$DA$1,PLAN!J:J),SUMIF(PLAN!$P:$P,\"D\"&\"-\"&$DI$1&\"-\"&$DA$1,PLAN!J:J))-SUMIF(GELİRLER!$H:$H,\"D\"&CY3&\"-\"&$DG$2&\"-\"&$DI$1&\"-\"&$DA$1,GELİRLER!$G:$G)","v":0},{"$f":"IF(DN3>0,SUMIF(PLAN!$P:$P,\"D\"&CY3&\"-\"&$DI$1&\"-\"&$DA$1,PLAN!K:K),SUMIF(PLAN!$P:$P,\"D\"&\"-\"&$DI$1&\"-\"&$DA$1,PLAN!K:K))-SUMIF(GELİRLER!$H:$H,\"D\"&CY3&\"-\"&$DH$2&\"-\"&$DI$1&\"-\"&$DA$1,GELİRLER!$G:$G)","v":0},{"$f":"IF(DN3>0,SUMIF(PLAN!$P:$P,\"D\"&CY3&\"-\"&$DI$1&\"-\"&$DA$1,PLAN!L:L),SUMIF(PLAN!$P:$P,\"D\"&\"-\"&$DI$1&\"-\"&$DA$1,PLAN!L:L))-SUMIF(GELİRLER!$H:$H,\"D\"&CY3&\"-\"&$DI$2&\"-\"&$DI$1&\"-\"&$DA$1,GELİRLER!$G:$G)","v":0},{"$f":"IF(DN3>0,SUMIF(PLAN!$P:$P,\"D\"&CY3&\"-\"&$DI$1&\"-\"&$DA$1,PLAN!M:M),SUMIF(PLAN!$P:$P,\"D\"&\"-\"&$DI$1&\"-\"&$DA$1,PLAN!M:M))-SUMIF(GELİRLER!$H:$H,\"D\"&CY3&\"-\"&$DJ$2&\"-\"&$DI$1&\"-\"&$DA$1,GELİRLER!$G:$G)","v":0},{"$f":"IF(DN3>0,SUMIF(PLAN!$P:$P,\"D\"&CY3&\"-\"&$DI$1&\"-\"&$DA$1,PLAN!N:N),SUMIF(PLAN!$P:$P,\"D\"&\"-\"&$DI$1&\"-\"&$DA$1,PLAN!N:N))-SUMIF(GELİRLER!$H:$H,\"D\"&CY3&\"-\"&$DK$2&\"-\"&$DI$1&\"-\"&$DA$1,GELİRLER!$G:$G)","v":0},{"$f":"IF(DN3>0,SUMIF(PLAN!$P:$P,\"D\"&CY3&\"-\"&$DI$1&\"-\"&$DA$1,PLAN!O:O),SUMIF(PLAN!$P:$P,\"D\"&\"-\"&$DI$1&\"-\"&$DA$1,PLAN!O:O))-SUMIF(GELİRLER!$H:$H,\"D\"&CY3&\"-\"&$DL$2&\"-\"&$DI$1&\"-\"&$DA$1,GELİRLER!$G:$G)","v":0},{"$f":"\"D\"&CY3&\"-\"&$DI$1&\"-\"&$DA$1","v":"D1-2016-Aidat"},{"$f":"COUNTIF(PLAN!P:P,DM3)","v":2},{"$f":"COUNTIF(PLAN!P:P,\"D\"&CY3&\"-\"&$DI$1&\"-YAKIT\")","v":0},{"$f":"ROUND(SUMIF(YAKIT!$J:$J,\"D\"&CY3&\"-\"&$DA$2&\"-\"&$DI$1&\"-\"&\"YAKIT\",YAKIT!$I:$I)+IF(DO3>0,SUMIF(PLAN!$P:$P,\"D\"&CY3&\"-\"&$DI$1&\"-\"&\"YAKIT\",PLAN!D:D),SUMIF(PLAN!$P:$P,\"D\"&\"-\"&$DI$1&\"-\"&\"YAKIT\",PLAN!D:D))-SUMIF(GELİRLER!$H:$H,\"D\"&CY3&\"-\"&$DA$2&\"-\"&$DI$1&\"-\"&\"YAKIT\",GELİRLER!$G:$G),2)","v":0},{"$f":"ROUND(SUMIF(YAKIT!$J:$J,\"D\"&CY3&\"-\"&$DB$2&\"-\"&$DI$1&\"-\"&\"YAKIT\",YAKIT!$I:$I)+IF(DO3>0,SUMIF(PLAN!$P:$P,\"D\"&CY3&\"-\"&$DI$1&\"-\"&\"YAKIT\",PLAN!E:E),SUMIF(PLAN!$P:$P,\"D\"&\"-\"&$DI$1&\"-\"&\"YAKIT\",PLAN!E:E))-SUMIF(GELİRLER!$H:$H,\"D\"&CY3&\"-\"&$DB$2&\"-\"&$DI$1&\"-\"&\"YAKIT\",GELİRLER!$G:$G),2)","v":0},{"$f":"ROUND(SUMIF(YAKIT!$J:$J,\"D\"&CY3&\"-\"&$DC$2&\"-\"&$DI$1&\"-\"&\"YAKIT\",YAKIT!$I:$I)+IF(DO3>0,SUMIF(PLAN!$P:$P,\"D\"&CY3&\"-\"&$DI$1&\"-\"&\"YAKIT\",PLAN!F:F),SUMIF(PLAN!$P:$P,\"D\"&\"-\"&$DI$1&\"-\"&\"YAKIT\",PLAN!F:F))-SUMIF(GELİRLER!$H:$H,\"D\"&CY3&\"-\"&$DC$2&\"-\"&$DI$1&\"-\"&\"YAKIT\",GELİRLER!$G:$G),2)","v":0},{"$f":"ROUND(SUMIF(YAKIT!$J:$J,\"D\"&CY3&\"-\"&$DD$2&\"-\"&$DI$1&\"-\"&\"YAKIT\",YAKIT!$I:$I)+IF(DO3>0,SUMIF(PLAN!$P:$P,\"D\"&CY3&\"-\"&$DI$1&\"-\"&\"YAKIT\",PLAN!G:G),SUMIF(PLAN!$P:$P,\"D\"&\"-\"&$DI$1&\"-\"&\"YAKIT\",PLAN!G:G))-SUMIF(GELİRLER!$H:$H,\"D\"&CY3&\"-\"&$DD$2&\"-\"&$DI$1&\"-\"&\"YAKIT\",GELİRLER!$G:$G),2)","v":0},{"$f":"ROUND(SUMIF(YAKIT!$J:$J,\"D\"&CY3&\"-\"&$DE$2&\"-\"&$DI$1&\"-\"&\"YAKIT\",YAKIT!$I:$I)+IF(DO3>0,SUMIF(PLAN!$P:$P,\"D\"&CY3&\"-\"&$DI$1&\"-\"&\"YAKIT\",PLAN!H:H),SUMIF(PLAN!$P:$P,\"D\"&\"-\"&$DI$1&\"-\"&\"YAKIT\",PLAN!H:H))-SUMIF(GELİRLER!$H:$H,\"D\"&CY3&\"-\"&$DE$2&\"-\"&$DI$1&\"-\"&\"YAKIT\",GELİRLER!$G:$G),2)","v":0},{"$f":"ROUND(SUMIF(YAKIT!$J:$J,\"D\"&CY3&\"-\"&$DF$2&\"-\"&$DI$1&\"-\"&\"YAKIT\",YAKIT!$I:$I)+IF(DO3>0,SUMIF(PLAN!$P:$P,\"D\"&CY3&\"-\"&$DI$1&\"-\"&\"YAKIT\",PLAN!I:I),SUMIF(PLAN!$P:$P,\"D\"&\"-\"&$DI$1&\"-\"&\"YAKIT\",PLAN!I:I))-SUMIF(GELİRLER!$H:$H,\"D\"&CY3&\"-\"&$DF$2&\"-\"&$DI$1&\"-\"&\"YAKIT\",GELİRLER!$G:$G),2)","v":0},{"$f":"ROUND(SUMIF(YAKIT!$J:$J,\"D\"&CY3&\"-\"&$DG$2&\"-\"&$DI$1&\"-\"&\"YAKIT\",YAKIT!$I:$I)+IF(DO3>0,SUMIF(PLAN!$P:$P,\"D\"&CY3&\"-\"&$DI$1&\"-\"&\"YAKIT\",PLAN!J:J),SUMIF(PLAN!$P:$P,\"D\"&\"-\"&$DI$1&\"-\"&\"YAKIT\",PLAN!J:J))-SUMIF(GELİRLER!$H:$H,\"D\"&CY3&\"-\"&$DG$2&\"-\"&$DI$1&\"-\"&\"YAKIT\",GELİRLER!$G:$G),2)","v":0},{"$f":"ROUND(SUMIF(YAKIT!$J:$J,\"D\"&CY3&\"-\"&$DH$2&\"-\"&$DI$1&\"-\"&\"YAKIT\",YAKIT!$I:$I)+IF(DO3>0,SUMIF(PLAN!$P:$P,\"D\"&CY3&\"-\"&$DI$1&\"-\"&\"YAKIT\",PLAN!K:K),SUMIF(PLAN!$P:$P,\"D\"&\"-\"&$DI$1&\"-\"&\"YAKIT\",PLAN!K:K))-SUMIF(GELİRLER!$H:$H,\"D\"&CY3&\"-\"&$DH$2&\"-\"&$DI$1&\"-\"&\"YAKIT\",GELİRLER!$G:$G),2)","v":0},{"$f":"ROUND(SUMIF(YAKIT!$J:$J,\"D\"&CY3&\"-\"&$DI$2&\"-\"&$DI$1&\"-\"&\"YAKIT\",YAKIT!$I:$I)+IF(DO3>0,SUMIF(PLAN!$P:$P,\"D\"&CY3&\"-\"&$DI$1&\"-\"&\"YAKIT\",PLAN!L:L),SUMIF(PLAN!$P:$P,\"D\"&\"-\"&$DI$1&\"-\"&\"YAKIT\",PLAN!L:L))-SUMIF(GELİRLER!$H:$H,\"D\"&CY3&\"-\"&$DI$2&\"-\"&$DI$1&\"-\"&\"YAKIT\",GELİRLER!$G:$G),2)","v":0},{"$f":"ROUND(SUMIF(YAKIT!$J:$J,\"D\"&CY3&\"-\"&$DJ$2&\"-\"&$DI$1&\"-\"&\"YAKIT\",YAKIT!$I:$I)+IF(DO3>0,SUMIF(PLAN!$P:$P,\"D\"&CY3&\"-\"&$DI$1&\"-\"&\"YAKIT\",PLAN!M:M),SUMIF(PLAN!$P:$P,\"D\"&\"-\"&$DI$1&\"-\"&\"YAKIT\",PLAN!M:M))-SUMIF(GELİRLER!$H:$H,\"D\"&CY3&\"-\"&$DJ$2&\"-\"&$DI$1&\"-\"&\"YAKIT\",GELİRLER!$G:$G),2)","v":0},{"$f":"ROUND(SUMIF(YAKIT!$J:$J,\"D\"&CY3&\"-\"&$DK$2&\"-\"&$DI$1&\"-\"&\"YAKIT\",YAKIT!$I:$I)+IF(DO3>0,SUMIF(PLAN!$P:$P,\"D\"&CY3&\"-\"&$DI$1&\"-\"&\"YAKIT\",PLAN!N:N),SUMIF(PLAN!$P:$P,\"D\"&\"-\"&$DI$1&\"-\"&\"YAKIT\",PLAN!N:N))-SUMIF(GELİRLER!$H:$H,\"D\"&CY3&\"-\"&$DK$2&\"-\"&$DI$1&\"-\"&\"YAKIT\",GELİRLER!$G:$G),2)","v":0},{"$f":"ROUND(SUMIF(YAKIT!$J:$J,\"D\"&CY3&\"-\"&$DL$2&\"-\"&$DI$1&\"-\"&\"YAKIT\",YAKIT!$I:$I)+IF(DO3>0,SUMIF(PLAN!$P:$P,\"D\"&CY3&\"-\"&$DI$1&\"-\"&\"YAKIT\",PLAN!O:O),SUMIF(PLAN!$P:$P,\"D\"&\"-\"&$DI$1&\"-\"&\"YAKIT\",PLAN!O:O))-SUMIF(GELİRLER!$H:$H,\"D\"&CY3&\"-\"&$DL$2&\"-\"&$DI$1&\"-\"&\"YAKIT\",GELİRLER!$G:$G),2)","v":0}]
["KALAN",100,20,45,0,0,0,0,0,0,0,0,0,{"$f":"SUMIF(GELİRLER!$H:$H,\"D\"&$W$1&\"-\"&N2&\"-\"&$V$1&\"-\"&$N$1,GELİRLER!$G:$G)","v":0},{"$f":"SUMIF(GELİRLER!$H:$H,\"D\"&$W$1&\"-\"&O2&\"-\"&$V$1&\"-\"&$N$1,GELİRLER!$G:$G)","v":0},{"$f":"SUMIF(GELİRLER!$H:$H,\"D\"&$W$1&\"-\"&P2&\"-\"&$V$1&\"-\"&$N$1,GELİRLER!$G:$G)","v":0},{"$f":"SUMIF(GELİRLER!$H:$H,\"D\"&$W$1&\"-\"&Q2&\"-\"&$V$1&\"-\"&$N$1,GELİRLER!$G:$G)","v":0},{"$f":"SUMIF(GELİRLER!$H:$H,\"D\"&$W$1&\"-\"&R2&\"-\"&$V$1&\"-\"&$N$1,GELİRLER!$G:$G)","v":0},{"$f":"SUMIF(GELİRLER!$H:$H,\"D\"&$W$1&\"-\"&S2&\"-\"&$V$1&\"-\"&$N$1,GELİRLER!$G:$G)","v":0},{"$f":"SUMIF(GELİRLER!$H:$H,\"D\"&$W$1&\"-\"&T2&\"-\"&$V$1&\"-\"&$N$1,GELİRLER!$G:$G)","v":0},{"$f":"SUMIF(GELİRLER!$H:$H,\"D\"&$W$1&\"-\"&U2&\"-\"&$V$1&\"-\"&$N$1,GELİRLER!$G:$G)","v":0},{"$f":"SUMIF(GELİRLER!$H:$H,\"D\"&$W$1&\"-\"&V2&\"-\"&$V$1&\"-\"&$N$1,GELİRLER!$G:$G)","v":0},{"$f":"SUMIF(GELİRLER!$H:$H,\"D\"&$W$1&\"-\"&W2&\"-\"&$V$1&\"-\"&$N$1,GELİRLER!$G:$G)","v":0},{"$f":"SUMIF(GELİRLER!$H:$H,\"D\"&$W$1&\"-\"&X2&\"-\"&$V$1&\"-\"&$N$1,GELİRLER!$G:$G)","v":0},{"$f":"SUMIF(GELİRLER!$H:$H,\"D\"&$W$1&\"-\"&Y2&\"-\"&$V$1&\"-\"&$N$1,GELİRLER!$G:$G)","v":0},{"$f":"SUMIF(GELİRLER!$H:$H,\"D\"&$AI$1&\"-\"&Z2&\"-\"&$AH$1&\"-\"&$Z$1,GELİRLER!$G:$G)","v":0},{"$f":"SUMIF(GELİRLER!$H:$H,\"D\"&$AI$1&\"-\"&AA2&\"-\"&$AH$1&\"-\"&$Z$1,GELİRLER!$G:$G)","v":0},{"$f":"SUMIF(GELİRLER!$H:$H,\"D\"&$AI$1&\"-\"&AB2&\"-\"&$AH$1&\"-\"&$Z$1,GELİRLER!$G:$G)","v":0},{"$f":"SUMIF(GELİRLER!$H:$H,\"D\"&$AI$1&\"-\"&AC2&\"-\"&$AH$1&\"-\"&$Z$1,GELİRLER!$G:$G)","v":0},{"$f":"SUMIF(GELİRLER!$H:$H,\"D\"&$AI$1&\"-\"&AD2&\"-\"&$AH$1&\"-\"&$Z$1,GELİRLER!$G:$G)","v":0},{"$f":"SUMIF(GELİRLER!$H:$H,\"D\"&$AI$1&\"-\"&AE2&\"-\"&$AH$1&\"-\"&$Z$1,GELİRLER!$G:$G)","v":0},{"$f":"SUMIF(GELİRLER!$H:$H,\"D\"&$AI$1&\"-\"&AF2&\"-\"&$AH$1&\"-\"&$Z$1,GELİRLER!$G:$G)","v":0},{"$f":"SUMIF(GELİRLER!$H:$H,\"D\"&$AI$1&\"-\"&AG2&\"-\"&$AH$1&\"-\"&$Z$1,GELİRLER!$G:$G)","v":0},{"$f":"SUMIF(GELİRLER!$H:$H,\"D\"&$AI$1&\"-\"&AH2&\"-\"&$AH$1&\"-\"&$Z$1,GELİRLER!$G:$G)","v":0},{"$f":"SUMIF(GELİRLER!$H:$H,\"D\"&$AI$1&\"-\"&AI2&\"-\"&$AH$1&\"-\"&$Z$1,GELİRLER!$G:$G)","v":0},{"$f":"SUMIF(GELİRLER!$H:$H,\"D\"&$AI$1&\"-\"&AJ2&\"-\"&$AH$1&\"-\"&$Z$1,GELİRLER!$G:$G)","v":0},{"$f":"SUMIF(GELİRLER!$H:$H,\"D\"&$AI$1&\"-\"&AK2&\"-\"&$AH$1&\"-\"&$Z$1,GELİRLER!$G:$G)","v":0},{"$f":"SUMIF(GELİRLER!$H:$H,\"D\"&$AU$1&\"-\"&AL2&\"-\"&$AT$1&\"-\"&$AL$1,GELİRLER!$G:$G)","v":0},{"$f":"SUMIF(GELİRLER!$H:$H,\"D\"&$AU$1&\"-\"&AM2&\"-\"&$AT$1&\"-\"&$AL$1,GELİRLER!$G:$G)","v":0},{"$f":"SUMIF(GELİRLER!$H:$H,\"D\"&$AU$1&\"-\"&AN2&\"-\"&$AT$1&\"-\"&$AL$1,GELİRLER!$G:$G)","v":0},{"$f":"SUMIF(GELİRLER!$H:$H,\"D\"&$AU$1&\"-\"&AO2&\"-\"&$AT$1&\"-\"&$AL$1,GELİRLER!$G:$G)","v":0},{"$f":"SUMIF(GELİRLER!$H:$H,\"D\"&$AU$1&\"-\"&AP2&\"-\"&$AT$1&\"-\"&$AL$1,GELİRLER!$G:$G)","v":0},{"$f":"SUMIF(GELİRLER!$H:$H,\"D\"&$AU$1&\"-\"&AQ2&\"-\"&$AT$1&\"-\"&$AL$1,GELİRLER!$G:$G)","v":0},{"$f":"SUMIF(GELİRLER!$H:$H,\"D\"&$AU$1&\"-\"&AR2&\"-\"&$AT$1&\"-\"&$AL$1,GELİRLER!$G:$G)","v":0},{"$f":"SUMIF(GELİRLER!$H:$H,\"D\"&$AU$1&\"-\"&AS2&\"-\"&$AT$1&\"-\"&$AL$1,GELİRLER!$G:$G)","v":0},{"$f":"SUMIF(GELİRLER!$H:$H,\"D\"&$AU$1&\"-\"&AT2&\"-\"&$AT$1&\"-\"&$AL$1,GELİRLER!$G:$G)","v":0},{"$f":"SUMIF(GELİRLER!$H:$H,\"D\"&$AU$1&\"-\"&AU2&\"-\"&$AT$1&\"-\"&$AL$1,GELİRLER!$G:$G)","v":0},{"$f":"SUMIF(GELİRLER!$H:$H,\"D\"&$AU$1&\"-\"&AV2&\"-\"&$AT$1&\"-\"&$AL$1,GELİRLER!$G:$G)","v":0},{"$f":"SUMIF(GELİRLER!$H:$H,\"D\"&$AU$1&\"-\"&AW2&\"-\"&$AT$1&\"-\"&$AL$1,GELİRLER!$G:$G)","v":0},{"$f":"SUMIF(GELİRLER!$H:$H,\"D\"&$BG$1&\"-\"&AX2&\"-\"&$BF$1&\"-\"&$AX$1,GELİRLER!$G:$G)","v":0},{"$f":"SUMIF(GELİRLER!$H:$H,\"D\"&$BG$1&\"-\"&AY2&\"-\"&$BF$1&\"-\"&$AX$1,GELİRLER!$G:$G)","v":0},{"$f":"SUMIF(GELİRLER!$H:$H,\"D\"&$BG$1&\"-\"&AZ2&\"-\"&$BF$1&\"-\"&$AX$1,GELİRLER!$G:$G)","v":0},{"$f":"SUMIF(GELİRLER!$H:$H,\"D\"&$BG$1&\"-\"&BA2&\"-\"&$BF$1&\"-\"&$AX$1,GELİRLER!$G:$G)","v":0},{"$f":"SUMIF(GELİRLER!$H:$H,\"D\"&$BG$1&\"-\"&BB2&\"-\"&$BF$1&\"-\"&$AX$1,GELİRLER!$G:$G)","v":0},{"$f":"SUMIF(GELİRLER!$H:$H,\"D\"&$BG$1&\"-\"&BC2&\"-\"&$BF$1&\"-\"&$AX$1,GELİRLER!$G:$G)","v":0},{"$f":"SUMIF(GELİRLER!$H:$H,\"D\"&$BG$1&\"-\"&BD2&\"-\"&$BF$1&\"-\"&$AX$1,GELİRLER!$G:$G)","v":0},{"$f":"SUMIF(GELİRLER!$H:$H,\"D\"&$BG$1&\"-\"&BE2&\"-\"&$BF$1&\"-\"&$AX$1,GELİRLER!$G:$G)","v":0},{"$f":"SUMIF(GELİRLER!$H:$H,\"D\"&$BG$1&\"-\"&BF2&\"-\"&$BF$1&\"-\"&$AX$1,GELİRLER!$G:$G)","v":0},{"$f":"SUMIF(GELİRLER!$H:$H,\"D\"&$BG$1&\"-\"&BG2&\"-\"&$BF$1&\"-\"&$AX$1,GELİRLER!$G:$G)","v":0},{"$f":"SUMIF(GELİRLER!$H:$H,\"D\"&$BG$1&\"-\"&BH2&\"-\"&$BF$1&\"-\"&$AX$1,GELİRLER!$G:$G)","v":0},{"$f":"SUMIF(GELİRLER!$H:$H,\"D\"&$BG$1&\"-\"&BI2&\"-\"&$BF$1&\"-\"&$AX$1,GELİRLER!$G:$G)","v":0},null,null,null,null,null,null,null,null,null,null,null,null,null,null,null,null,null,null,null,null,null,null,null,null,null,null,null,null,null,null,null,null,null,null,null,null,null,null,null,null,null,{"$f":"IF(ÜYE!B3>\"\",ÜYE!A3,\"\")","v":2},{"$f":"IF(ÜYE!B3>\"\",ÜYE!A3&\"-\"&ÜYE!B3,\"\")","v":"2-Arslan"},{"$f":"IF(DN4>0,SUMIF(PLAN!$P:$P,\"D\"&CY4&\"-\"&$DI$1&\"-\"&$DA$1,PLAN!D:D),SUMIF(PLAN!$P:$P,\"D\"&\"-\"&$DI$1&\"-\"&$DA$1,PLAN!D:D))-SUMIF(GELİRLER!$H:$H,\"D\"&CY4&\"-\"&$DA$2&\"-\"&$DI$1&\"-\"&$DA$1,GELİRLER!$G:$G)","v":100},{"$f":"IF(DN4>0,SUMIF(PLAN!$P:$P,\"D\"&CY4&\"-\"&$DI$1&\"-\"&$DA$1,PLAN!E:E),SUMIF(PLAN!$P:$P,\"D\"&\"-\"&$DI$1&\"-\"&$DA$1,PLAN!E:E))-SUMIF(GELİRLER!$H:$H,\"D\"&CY4&\"-\"&$DB$2&\"-\"&$DI$1&\"-\"&$DA$1,GELİRLER!$G:$G)","v":20},{"$f":"IF(DN4>0,SUMIF(PLAN!$P:$P,\"D\"&CY4&\"-\"&$DI$1&\"-\"&$DA$1,PLAN!F:F),SUMIF(PLAN!$P:$P,\"D\"&\"-\"&$DI$1&\"-\"&$DA$1,PLAN!F:F))-SUMIF(GELİRLER!$H:$H,\"D\"&CY4&\"-\"&$DC$2&\"-\"&$DI$1&\"-\"&$DA$1,GELİRLER!$G:$G)","v":45},{"$f":"IF(DN4>0,SUMIF(PLAN!$P:$P,\"D\"&CY4&\"-\"&$DI$1&\"-\"&$DA$1,PLAN!G:G),SUMIF(PLAN!$P:$P,\"D\"&\"-\"&$DI$1&\"-\"&$DA$1,PLAN!G:G))-SUMIF(GELİRLER!$H:$H,\"D\"&CY4&\"-\"&$DD$2&\"-\"&$DI$1&\"-\"&$DA$1,GELİRLER!$G:$G)","v":0},{"$f":"IF(DN4>0,SUMIF(PLAN!$P:$P,\"D\"&CY4&\"-\"&$DI$1&\"-\"&$DA$1,PLAN!H:H),SUMIF(PLAN!$P:$P,\"D\"&\"-\"&$DI$1&\"-\"&$DA$1,PLAN!H:H))-SUMIF(GELİRLER!$H:$H,\"D\"&CY4&\"-\"&$DE$2&\"-\"&$DI$1&\"-\"&$DA$1,GELİRLER!$G:$G)","v":0},{"$f":"IF(DN4>0,SUMIF(PLAN!$P:$P,\"D\"&CY4&\"-\"&$DI$1&\"-\"&$DA$1,PLAN!I:I),SUMIF(PLAN!$P:$P,\"D\"&\"-\"&$DI$1&\"-\"&$DA$1,PLAN!I:I))-SUMIF(GELİRLER!$H:$H,\"D\"&CY4&\"-\"&$DF$2&\"-\"&$DI$1&\"-\"&$DA$1,GELİRLER!$G:$G)","v":0},{"$f":"IF(DN4>0,SUMIF(PLAN!$P:$P,\"D\"&CY4&\"-\"&$DI$1&\"-\"&$DA$1,PLAN!J:J),SUMIF(PLAN!$P:$P,\"D\"&\"-\"&$DI$1&\"-\"&$DA$1,PLAN!J:J))-SUMIF(GELİRLER!$H:$H,\"D\"&CY4&\"-\"&$DG$2&\"-\"&$DI$1&\"-\"&$DA$1,GELİRLER!$G:$G)","v":0},{"$f":"IF(DN4>0,SUMIF(PLAN!$P:$P,\"D\"&CY4&\"-\"&$DI$1&\"-\"&$DA$1,PLAN!K:K),SUMIF(PLAN!$P:$P,\"D\"&\"-\"&$DI$1&\"-\"&$DA$1,PLAN!K:K))-SUMIF(GELİRLER!$H:$H,\"D\"&CY4&\"-\"&$DH$2&\"-\"&$DI$1&\"-\"&$DA$1,GELİRLER!$G:$G)","v":0},{"$f":"IF(DN4>0,SUMIF(PLAN!$P:$P,\"D\"&CY4&\"-\"&$DI$1&\"-\"&$DA$1,PLAN!L:L),SUMIF(PLAN!$P:$P,\"D\"&\"-\"&$DI$1&\"-\"&$DA$1,PLAN!L:L))-SUMIF(GELİRLER!$H:$H,\"D\"&CY4&\"-\"&$DI$2&\"-\"&$DI$1&\"-\"&$DA$1,GELİRLER!$G:$G)","v":0},{"$f":"IF(DN4>0,SUMIF(PLAN!$P:$P,\"D\"&CY4&\"-\"&$DI$1&\"-\"&$DA$1,PLAN!M:M),SUMIF(PLAN!$P:$P,\"D\"&\"-\"&$DI$1&\"-\"&$DA$1,PLAN!M:M))-SUMIF(GELİRLER!$H:$H,\"D\"&CY4&\"-\"&$DJ$2&\"-\"&$DI$1&\"-\"&$DA$1,GELİRLER!$G:$G)","v":0},{"$f":"IF(DN4>0,SUMIF(PLAN!$P:$P,\"D\"&CY4&\"-\"&$DI$1&\"-\"&$DA$1,PLAN!N:N),SUMIF(PLAN!$P:$P,\"D\"&\"-\"&$DI$1&\"-\"&$DA$1,PLAN!N:N))-SUMIF(GELİRLER!$H:$H,\"D\"&CY4&\"-\"&$DK$2&\"-\"&$DI$1&\"-\"&$DA$1,GELİRLER!$G:$G)","v":0},{"$f":"IF(DN4>0,SUMIF(PLAN!$P:$P,\"D\"&CY4&\"-\"&$DI$1&\"-\"&$DA$1,PLAN!O:O),SUMIF(PLAN!$P:$P,\"D\"&\"-\"&$DI$1&\"-\"&$DA$1,PLAN!O:O))-SUMIF(GELİRLER!$H:$H,\"D\"&CY4&\"-\"&$DL$2&\"-\"&$DI$1&\"-\"&$DA$1,GELİRLER!$G:$G)","v":0},"D2-2016-Aidat",{"$f":"COUNTIF(PLAN!P:P,DM4)","v":0},{"$f":"COUNTIF(PLAN!P:P,\"D\"&CY4&\"-\"&$DI$1&\"-YAKIT\")","v":0},{"$f":"ROUND(SUMIF(YAKIT!$J:$J,\"D\"&CY4&\"-\"&$DA$2&\"-\"&$DI$1&\"-\"&\"YAKIT\",YAKIT!$I:$I)+IF(DO4>0,SUMIF(PLAN!$P:$P,\"D\"&CY4&\"-\"&$DI$1&\"-\"&\"YAKIT\",PLAN!D:D),SUMIF(PLAN!$P:$P,\"D\"&\"-\"&$DI$1&\"-\"&\"YAKIT\",PLAN!D:D))-SUMIF(GELİRLER!$H:$H,\"D\"&CY4&\"-\"&$DA$2&\"-\"&$DI$1&\"-\"&\"YAKIT\",GELİRLER!$G:$G),2)","v":0},{"$f":"ROUND(SUMIF(YAKIT!$J:$J,\"D\"&CY4&\"-\"&$DB$2&\"-\"&$DI$1&\"-\"&\"YAKIT\",YAKIT!$I:$I)+IF(DO4>0,SUMIF(PLAN!$P:$P,\"D\"&CY4&\"-\"&$DI$1&\"-\"&\"YAKIT\",PLAN!E:E),SUMIF(PLAN!$P:$P,\"D\"&\"-\"&$DI$1&\"-\"&\"YAKIT\",PLAN!E:E))-SUMIF(GELİRLER!$H:$H,\"D\"&CY4&\"-\"&$DB$2&\"-\"&$DI$1&\"-\"&\"YAKIT\",GELİRLER!$G:$G),2)","v":0},{"$f":"ROUND(SUMIF(YAKIT!$J:$J,\"D\"&CY4&\"-\"&$DC$2&\"-\"&$DI$1&\"-\"&\"YAKIT\",YAKIT!$I:$I)+IF(DO4>0,SUMIF(PLAN!$P:$P,\"D\"&CY4&\"-\"&$DI$1&\"-\"&\"YAKIT\",PLAN!F:F),SUMIF(PLAN!$P:$P,\"D\"&\"-\"&$DI$1&\"-\"&\"YAKIT\",PLAN!F:F))-SUMIF(GELİRLER!$H:$H,\"D\"&CY4&\"-\"&$DC$2&\"-\"&$DI$1&\"-\"&\"YAKIT\",GELİRLER!$G:$G),2)","v":0},{"$f":"ROUND(SUMIF(YAKIT!$J:$J,\"D\"&CY4&\"-\"&$DD$2&\"-\"&$DI$1&\"-\"&\"YAKIT\",YAKIT!$I:$I)+IF(DO4>0,SUMIF(PLAN!$P:$P,\"D\"&CY4&\"-\"&$DI$1&\"-\"&\"YAKIT\",PLAN!G:G),SUMIF(PLAN!$P:$P,\"D\"&\"-\"&$DI$1&\"-\"&\"YAKIT\",PLAN!G:G))-SUMIF(GELİRLER!$H:$H,\"D\"&CY4&\"-\"&$DD$2&\"-\"&$DI$1&\"-\"&\"YAKIT\",GELİRLER!$G:$G),2)","v":0},{"$f":"ROUND(SUMIF(YAKIT!$J:$J,\"D\"&CY4&\"-\"&$DE$2&\"-\"&$DI$1&\"-\"&\"YAKIT\",YAKIT!$I:$I)+IF(DO4>0,SUMIF(PLAN!$P:$P,\"D\"&CY4&\"-\"&$DI$1&\"-\"&\"YAKIT\",PLAN!H:H),SUMIF(PLAN!$P:$P,\"D\"&\"-\"&$DI$1&\"-\"&\"YAKIT\",PLAN!H:H))-SUMIF(GELİRLER!$H:$H,\"D\"&CY4&\"-\"&$DE$2&\"-\"&$DI$1&\"-\"&\"YAKIT\",GELİRLER!$G:$G),2)","v":0},{"$f":"ROUND(SUMIF(YAKIT!$J:$J,\"D\"&CY4&\"-\"&$DF$2&\"-\"&$DI$1&\"-\"&\"YAKIT\",YAKIT!$I:$I)+IF(DO4>0,SUMIF(PLAN!$P:$P,\"D\"&CY4&\"-\"&$DI$1&\"-\"&\"YAKIT\",PLAN!I:I),SUMIF(PLAN!$P:$P,\"D\"&\"-\"&$DI$1&\"-\"&\"YAKIT\",PLAN!I:I))-SUMIF(GELİRLER!$H:$H,\"D\"&CY4&\"-\"&$DF$2&\"-\"&$DI$1&\"-\"&\"YAKIT\",GELİRLER!$G:$G),2)","v":0},{"$f":"ROUND(SUMIF(YAKIT!$J:$J,\"D\"&CY4&\"-\"&$DG$2&\"-\"&$DI$1&\"-\"&\"YAKIT\",YAKIT!$I:$I)+IF(DO4>0,SUMIF(PLAN!$P:$P,\"D\"&CY4&\"-\"&$DI$1&\"-\"&\"YAKIT\",PLAN!J:J),SUMIF(PLAN!$P:$P,\"D\"&\"-\"&$DI$1&\"-\"&\"YAKIT\",PLAN!J:J))-SUMIF(GELİRLER!$H:$H,\"D\"&CY4&\"-\"&$DG$2&\"-\"&$DI$1&\"-\"&\"YAKIT\",GELİRLER!$G:$G),2)","v":0},{"$f":"ROUND(SUMIF(YAKIT!$J:$J,\"D\"&CY4&\"-\"&$DH$2&\"-\"&$DI$1&\"-\"&\"YAKIT\",YAKIT!$I:$I)+IF(DO4>0,SUMIF(PLAN!$P:$P,\"D\"&CY4&\"-\"&$DI$1&\"-\"&\"YAKIT\",PLAN!K:K),SUMIF(PLAN!$P:$P,\"D\"&\"-\"&$DI$1&\"-\"&\"YAKIT\",PLAN!K:K))-SUMIF(GELİRLER!$H:$H,\"D\"&CY4&\"-\"&$DH$2&\"-\"&$DI$1&\"-\"&\"YAKIT\",GELİRLER!$G:$G),2)","v":0},{"$f":"ROUND(SUMIF(YAKIT!$J:$J,\"D\"&CY4&\"-\"&$DI$2&\"-\"&$DI$1&\"-\"&\"YAKIT\",YAKIT!$I:$I)+IF(DO4>0,SUMIF(PLAN!$P:$P,\"D\"&CY4&\"-\"&$DI$1&\"-\"&\"YAKIT\",PLAN!L:L),SUMIF(PLAN!$P:$P,\"D\"&\"-\"&$DI$1&\"-\"&\"YAKIT\",PLAN!L:L))-SUMIF(GELİRLER!$H:$H,\"D\"&CY4&\"-\"&$DI$2&\"-\"&$DI$1&\"-\"&\"YAKIT\",GELİRLER!$G:$G),2)","v":0},{"$f":"ROUND(SUMIF(YAKIT!$J:$J,\"D\"&CY4&\"-\"&$DJ$2&\"-\"&$DI$1&\"-\"&\"YAKIT\",YAKIT!$I:$I)+IF(DO4>0,SUMIF(PLAN!$P:$P,\"D\"&CY4&\"-\"&$DI$1&\"-\"&\"YAKIT\",PLAN!M:M),SUMIF(PLAN!$P:$P,\"D\"&\"-\"&$DI$1&\"-\"&\"YAKIT\",PLAN!M:M))-SUMIF(GELİRLER!$H:$H,\"D\"&CY4&\"-\"&$DJ$2&\"-\"&$DI$1&\"-\"&\"YAKIT\",GELİRLER!$G:$G),2)","v":0},{"$f":"ROUND(SUMIF(YAKIT!$J:$J,\"D\"&CY4&\"-\"&$DK$2&\"-\"&$DI$1&\"-\"&\"YAKIT\",YAKIT!$I:$I)+IF(DO4>0,SUMIF(PLAN!$P:$P,\"D\"&CY4&\"-\"&$DI$1&\"-\"&\"YAKIT\",PLAN!N:N),SUMIF(PLAN!$P:$P,\"D\"&\"-\"&$DI$1&\"-\"&\"YAKIT\",PLAN!N:N))-SUMIF(GELİRLER!$H:$H,\"D\"&CY4&\"-\"&$DK$2&\"-\"&$DI$1&\"-\"&\"YAKIT\",GELİRLER!$G:$G),2)","v":0},{"$f":"ROUND(SUMIF(YAKIT!$J:$J,\"D\"&CY4&\"-\"&$DL$2&\"-\"&$DI$1&\"-\"&\"YAKIT\",YAKIT!$I:$I)+IF(DO4>0,SUMIF(PLAN!$P:$P,\"D\"&CY4&\"-\"&$DI$1&\"-\"&\"YAKIT\",PLAN!O:O),SUMIF(PLAN!$P:$P,\"D\"&\"-\"&$DI$1&\"-\"&\"YAKIT\",PLAN!O:O))-SUMIF(GELİRLER!$H:$H,\"D\"&CY4&\"-\"&$DL$2&\"-\"&$DI$1&\"-\"&\"YAKIT\",GELİRLER!$G:$G),2)","v":0}]
[null,null,null,null,null,null,null,null,null,null,null,null,null,{"$f":"+N3-N4","v":0},0,0,0,0,{"$f":"+S3-S4","v":0},{"$f":"+T3-T4","v":0},0,0,0,0,0,0,0,0,0,0,0,0,0,0,0,0,0,0,0,0,0,0,0,0,0,0,0,0,0,0,0,0,0,0,0,0,0,0,0,0,0,null,null,null,null,null,null,null,null,null,null,null,null,null,null,null,null,null,null,null,null,null,null,null,null,null,null,null,null,null,null,null,null,null,null,null,null,null,null,null,null,null,{"$f":"IF(ÜYE!B4>\"\",ÜYE!A4,\"\")","v":3},{"$f":"IF(ÜYE!B4>\"\",ÜYE!A4&\"-\"&ÜYE!B4,\"\")","v":"3-Dilek"},{"$f":"IF(DN5>0,SUMIF(PLAN!$P:$P,\"D\"&CY5&\"-\"&$DI$1&\"-\"&$DA$1,PLAN!D:D),SUMIF(PLAN!$P:$P,\"D\"&\"-\"&$DI$1&\"-\"&$DA$1,PLAN!D:D))-SUMIF(GELİRLER!$H:$H,\"D\"&CY5&\"-\"&$DA$2&\"-\"&$DI$1&\"-\"&$DA$1,GELİRLER!$G:$G)","v":100},{"$f":"IF(DN5>0,SUMIF(PLAN!$P:$P,\"D\"&CY5&\"-\"&$DI$1&\"-\"&$DA$1,PLAN!E:E),SUMIF(PLAN!$P:$P,\"D\"&\"-\"&$DI$1&\"-\"&$DA$1,PLAN!E:E))-SUMIF(GELİRLER!$H:$H,\"D\"&CY5&\"-\"&$DB$2&\"-\"&$DI$1&\"-\"&$DA$1,GELİRLER!$G:$G)","v":20},{"$f":"IF(DN5>0,SUMIF(PLAN!$P:$P,\"D\"&CY5&\"-\"&$DI$1&\"-\"&$DA$1,PLAN!F:F),SUMIF(PLAN!$P:$P,\"D\"&\"-\"&$DI$1&\"-\"&$DA$1,PLAN!F:F))-SUMIF(GELİRLER!$H:$H,\"D\"&CY5&\"-\"&$DC$2&\"-\"&$DI$1&\"-\"&$DA$1,GELİRLER!$G:$G)","v":45},{"$f":"IF(DN5>0,SUMIF(PLAN!$P:$P,\"D\"&CY5&\"-\"&$DI$1&\"-\"&$DA$1,PLAN!G:G),SUMIF(PLAN!$P:$P,\"D\"&\"-\"&$DI$1&\"-\"&$DA$1,PLAN!G:G))-SUMIF(GELİRLER!$H:$H,\"D\"&CY5&\"-\"&$DD$2&\"-\"&$DI$1&\"-\"&$DA$1,GELİRLER!$G:$G)","v":0},{"$f":"IF(DN5>0,SUMIF(PLAN!$P:$P,\"D\"&CY5&\"-\"&$DI$1&\"-\"&$DA$1,PLAN!H:H),SUMIF(PLAN!$P:$P,\"D\"&\"-\"&$DI$1&\"-\"&$DA$1,PLAN!H:H))-SUMIF(GELİRLER!$H:$H,\"D\"&CY5&\"-\"&$DE$2&\"-\"&$DI$1&\"-\"&$DA$1,GELİRLER!$G:$G)","v":0},{"$f":"IF(DN5>0,SUMIF(PLAN!$P:$P,\"D\"&CY5&\"-\"&$DI$1&\"-\"&$DA$1,PLAN!I:I),SUMIF(PLAN!$P:$P,\"D\"&\"-\"&$DI$1&\"-\"&$DA$1,PLAN!I:I))-SUMIF(GELİRLER!$H:$H,\"D\"&CY5&\"-\"&$DF$2&\"-\"&$DI$1&\"-\"&$DA$1,GELİRLER!$G:$G)","v":0},{"$f":"IF(DN5>0,SUMIF(PLAN!$P:$P,\"D\"&CY5&\"-\"&$DI$1&\"-\"&$DA$1,PLAN!J:J),SUMIF(PLAN!$P:$P,\"D\"&\"-\"&$DI$1&\"-\"&$DA$1,PLAN!J:J))-SUMIF(GELİRLER!$H:$H,\"D\"&CY5&\"-\"&$DG$2&\"-\"&$DI$1&\"-\"&$DA$1,GELİRLER!$G:$G)","v":0},{"$f":"IF(DN5>0,SUMIF(PLAN!$P:$P,\"D\"&CY5&\"-\"&$DI$1&\"-\"&$DA$1,PLAN!K:K),SUMIF(PLAN!$P:$P,\"D\"&\"-\"&$DI$1&\"-\"&$DA$1,PLAN!K:K))-SUMIF(GELİRLER!$H:$H,\"D\"&CY5&\"-\"&$DH$2&\"-\"&$DI$1&\"-\"&$DA$1,GELİRLER!$G:$G)","v":0},{"$f":"IF(DN5>0,SUMIF(PLAN!$P:$P,\"D\"&CY5&\"-\"&$DI$1&\"-\"&$DA$1,PLAN!L:L),SUMIF(PLAN!$P:$P,\"D\"&\"-\"&$DI$1&\"-\"&$DA$1,PLAN!L:L))-SUMIF(GELİRLER!$H:$H,\"D\"&CY5&\"-\"&$DI$2&\"-\"&$DI$1&\"-\"&$DA$1,GELİRLER!$G:$G)","v":0},{"$f":"IF(DN5>0,SUMIF(PLAN!$P:$P,\"D\"&CY5&\"-\"&$DI$1&\"-\"&$DA$1,PLAN!M:M),SUMIF(PLAN!$P:$P,\"D\"&\"-\"&$DI$1&\"-\"&$DA$1,PLAN!M:M))-SUMIF(GELİRLER!$H:$H,\"D\"&CY5&\"-\"&$DJ$2&\"-\"&$DI$1&\"-\"&$DA$1,GELİRLER!$G:$G)","v":0},{"$f":"IF(DN5>0,SUMIF(PLAN!$P:$P,\"D\"&CY5&\"-\"&$DI$1&\"-\"&$DA$1,PLAN!N:N),SUMIF(PLAN!$P:$P,\"D\"&\"-\"&$DI$1&\"-\"&$DA$1,PLAN!N:N))-SUMIF(GELİRLER!$H:$H,\"D\"&CY5&\"-\"&$DK$2&\"-\"&$DI$1&\"-\"&$DA$1,GELİRLER!$G:$G)","v":0},{"$f":"IF(DN5>0,SUMIF(PLAN!$P:$P,\"D\"&CY5&\"-\"&$DI$1&\"-\"&$DA$1,PLAN!O:O),SUMIF(PLAN!$P:$P,\"D\"&\"-\"&$DI$1&\"-\"&$DA$1,PLAN!O:O))-SUMIF(GELİRLER!$H:$H,\"D\"&CY5&\"-\"&$DL$2&\"-\"&$DI$1&\"-\"&$DA$1,GELİRLER!$G:$G)","v":0},"D3-2016-Aidat",{"$f":"COUNTIF(PLAN!P:P,DM5)","v":0},{"$f":"COUNTIF(PLAN!P:P,\"D\"&CY5&\"-\"&$DI$1&\"-YAKIT\")","v":0},{"$f":"ROUND(SUMIF(YAKIT!$J:$J,\"D\"&CY5&\"-\"&$DA$2&\"-\"&$DI$1&\"-\"&\"YAKIT\",YAKIT!$I:$I)+IF(DO5>0,SUMIF(PLAN!$P:$P,\"D\"&CY5&\"-\"&$DI$1&\"-\"&\"YAKIT\",PLAN!D:D),SUMIF(PLAN!$P:$P,\"D\"&\"-\"&$DI$1&\"-\"&\"YAKIT\",PLAN!D:D))-SUMIF(GELİRLER!$H:$H,\"D\"&CY5&\"-\"&$DA$2&\"-\"&$DI$1&\"-\"&\"YAKIT\",GELİRLER!$G:$G),2)","v":0},{"$f":"ROUND(SUMIF(YAKIT!$J:$J,\"D\"&CY5&\"-\"&$DB$2&\"-\"&$DI$1&\"-\"&\"YAKIT\",YAKIT!$I:$I)+IF(DO5>0,SUMIF(PLAN!$P:$P,\"D\"&CY5&\"-\"&$DI$1&\"-\"&\"YAKIT\",PLAN!E:E),SUMIF(PLAN!$P:$P,\"D\"&\"-\"&$DI$1&\"-\"&\"YAKIT\",PLAN!E:E))-SUMIF(GELİRLER!$H:$H,\"D\"&CY5&\"-\"&$DB$2&\"-\"&$DI$1&\"-\"&\"YAKIT\",GELİRLER!$G:$G),2)","v":0},{"$f":"ROUND(SUMIF(YAKIT!$J:$J,\"D\"&CY5&\"-\"&$DC$2&\"-\"&$DI$1&\"-\"&\"YAKIT\",YAKIT!$I:$I)+IF(DO5>0,SUMIF(PLAN!$P:$P,\"D\"&CY5&\"-\"&$DI$1&\"-\"&\"YAKIT\",PLAN!F:F),SUMIF(PLAN!$P:$P,\"D\"&\"-\"&$DI$1&\"-\"&\"YAKIT\",PLAN!F:F))-SUMIF(GELİRLER!$H:$H,\"D\"&CY5&\"-\"&$DC$2&\"-\"&$DI$1&\"-\"&\"YAKIT\",GELİRLER!$G:$G),2)","v":0},{"$f":"ROUND(SUMIF(YAKIT!$J:$J,\"D\"&CY5&\"-\"&$DD$2&\"-\"&$DI$1&\"-\"&\"YAKIT\",YAKIT!$I:$I)+IF(DO5>0,SUMIF(PLAN!$P:$P,\"D\"&CY5&\"-\"&$DI$1&\"-\"&\"YAKIT\",PLAN!G:G),SUMIF(PLAN!$P:$P,\"D\"&\"-\"&$DI$1&\"-\"&\"YAKIT\",PLAN!G:G))-SUMIF(GELİRLER!$H:$H,\"D\"&CY5&\"-\"&$DD$2&\"-\"&$DI$1&\"-\"&\"YAKIT\",GELİRLER!$G:$G),2)","v":0},{"$f":"ROUND(SUMIF(YAKIT!$J:$J,\"D\"&CY5&\"-\"&$DE$2&\"-\"&$DI$1&\"-\"&\"YAKIT\",YAKIT!$I:$I)+IF(DO5>0,SUMIF(PLAN!$P:$P,\"D\"&CY5&\"-\"&$DI$1&\"-\"&\"YAKIT\",PLAN!H:H),SUMIF(PLAN!$P:$P,\"D\"&\"-\"&$DI$1&\"-\"&\"YAKIT\",PLAN!H:H))-SUMIF(GELİRLER!$H:$H,\"D\"&CY5&\"-\"&$DE$2&\"-\"&$DI$1&\"-\"&\"YAKIT\",GELİRLER!$G:$G),2)","v":0},{"$f":"ROUND(SUMIF(YAKIT!$J:$J,\"D\"&CY5&\"-\"&$DF$2&\"-\"&$DI$1&\"-\"&\"YAKIT\",YAKIT!$I:$I)+IF(DO5>0,SUMIF(PLAN!$P:$P,\"D\"&CY5&\"-\"&$DI$1&\"-\"&\"YAKIT\",PLAN!I:I),SUMIF(PLAN!$P:$P,\"D\"&\"-\"&$DI$1&\"-\"&\"YAKIT\",PLAN!I:I))-SUMIF(GELİRLER!$H:$H,\"D\"&CY5&\"-\"&$DF$2&\"-\"&$DI$1&\"-\"&\"YAKIT\",GELİRLER!$G:$G),2)","v":0},{"$f":"ROUND(SUMIF(YAKIT!$J:$J,\"D\"&CY5&\"-\"&$DG$2&\"-\"&$DI$1&\"-\"&\"YAKIT\",YAKIT!$I:$I)+IF(DO5>0,SUMIF(PLAN!$P:$P,\"D\"&CY5&\"-\"&$DI$1&\"-\"&\"YAKIT\",PLAN!J:J),SUMIF(PLAN!$P:$P,\"D\"&\"-\"&$DI$1&\"-\"&\"YAKIT\",PLAN!J:J))-SUMIF(GELİRLER!$H:$H,\"D\"&CY5&\"-\"&$DG$2&\"-\"&$DI$1&\"-\"&\"YAKIT\",GELİRLER!$G:$G),2)","v":0},{"$f":"ROUND(SUMIF(YAKIT!$J:$J,\"D\"&CY5&\"-\"&$DH$2&\"-\"&$DI$1&\"-\"&\"YAKIT\",YAKIT!$I:$I)+IF(DO5>0,SUMIF(PLAN!$P:$P,\"D\"&CY5&\"-\"&$DI$1&\"-\"&\"YAKIT\",PLAN!K:K),SUMIF(PLAN!$P:$P,\"D\"&\"-\"&$DI$1&\"-\"&\"YAKIT\",PLAN!K:K))-SUMIF(GELİRLER!$H:$H,\"D\"&CY5&\"-\"&$DH$2&\"-\"&$DI$1&\"-\"&\"YAKIT\",GELİRLER!$G:$G),2)","v":0},{"$f":"ROUND(SUMIF(YAKIT!$J:$J,\"D\"&CY5&\"-\"&$DI$2&\"-\"&$DI$1&\"-\"&\"YAKIT\",YAKIT!$I:$I)+IF(DO5>0,SUMIF(PLAN!$P:$P,\"D\"&CY5&\"-\"&$DI$1&\"-\"&\"YAKIT\",PLAN!L:L),SUMIF(PLAN!$P:$P,\"D\"&\"-\"&$DI$1&\"-\"&\"YAKIT\",PLAN!L:L))-SUMIF(GELİRLER!$H:$H,\"D\"&CY5&\"-\"&$DI$2&\"-\"&$DI$1&\"-\"&\"YAKIT\",GELİRLER!$G:$G),2)","v":0},{"$f":"ROUND(SUMIF(YAKIT!$J:$J,\"D\"&CY5&\"-\"&$DJ$2&\"-\"&$DI$1&\"-\"&\"YAKIT\",YAKIT!$I:$I)+IF(DO5>0,SUMIF(PLAN!$P:$P,\"D\"&CY5&\"-\"&$DI$1&\"-\"&\"YAKIT\",PLAN!M:M),SUMIF(PLAN!$P:$P,\"D\"&\"-\"&$DI$1&\"-\"&\"YAKIT\",PLAN!M:M))-SUMIF(GELİRLER!$H:$H,\"D\"&CY5&\"-\"&$DJ$2&\"-\"&$DI$1&\"-\"&\"YAKIT\",GELİRLER!$G:$G),2)","v":0},{"$f":"ROUND(SUMIF(YAKIT!$J:$J,\"D\"&CY5&\"-\"&$DK$2&\"-\"&$DI$1&\"-\"&\"YAKIT\",YAKIT!$I:$I)+IF(DO5>0,SUMIF(PLAN!$P:$P,\"D\"&CY5&\"-\"&$DI$1&\"-\"&\"YAKIT\",PLAN!N:N),SUMIF(PLAN!$P:$P,\"D\"&\"-\"&$DI$1&\"-\"&\"YAKIT\",PLAN!N:N))-SUMIF(GELİRLER!$H:$H,\"D\"&CY5&\"-\"&$DK$2&\"-\"&$DI$1&\"-\"&\"YAKIT\",GELİRLER!$G:$G),2)","v":0},{"$f":"ROUND(SUMIF(YAKIT!$J:$J,\"D\"&CY5&\"-\"&$DL$2&\"-\"&$DI$1&\"-\"&\"YAKIT\",YAKIT!$I:$I)+IF(DO5>0,SUMIF(PLAN!$P:$P,\"D\"&CY5&\"-\"&$DI$1&\"-\"&\"YAKIT\",PLAN!O:O),SUMIF(PLAN!$P:$P,\"D\"&\"-\"&$DI$1&\"-\"&\"YAKIT\",PLAN!O:O))-SUMIF(GELİRLER!$H:$H,\"D\"&CY5&\"-\"&$DL$2&\"-\"&$DI$1&\"-\"&\"YAKIT\",GELİRLER!$G:$G),2)","v":0}]
["DEMİRBAŞ",{"$f":"+N3","v":0},0,0,0,0,0,0,0,0,0,0,0,null,"AİDAT",null,null,null,null,null,null,null,2016,null,{"$f":"COUNTIF(PLAN!P:P,Z6)","v":3},{"$f":"\"D\"&$X$6&\"-\"&$W$6&\"-\"&$O$6","v":"D-2016-AİDAT"},null,null,null,null,null,null,null,null,null,null,null,null,null,null,null,null,null,null,null,null,null,null,null,null,null,null,null,null,null,null,null,null,null,null,null,null,null,null,null,null,null,null,null,null,null,"Şubat","Aidat",null,null,"GELİR TÜR'Ü","OCAK","ŞUBAT","MART","NİSAN","MAYIS","HAZİRAN","TEMMUZ","AĞUSTOS","EYLÜL","EKİM","KASIM","ARALIK",null,null,null,null,null,null,null,null,null,null,null,null,null,null,{"$f":"IF(ÜYE!B5>\"\",ÜYE!A5,\"\")","v":4},{"$f":"IF(ÜYE!B5>\"\",ÜYE!A5&\"-\"&ÜYE!B5,\"\")","v":"4-Kırıkçı"},{"$f":"IF(DN6>0,SUMIF(PLAN!$P:$P,\"D\"&CY6&\"-\"&$DI$1&\"-\"&$DA$1,PLAN!D:D),SUMIF(PLAN!$P:$P,\"D\"&\"-\"&$DI$1&\"-\"&$DA$1,PLAN!D:D))-SUMIF(GELİRLER!$H:$H,\"D\"&CY6&\"-\"&$DA$2&\"-\"&$DI$1&\"-\"&$DA$1,GELİRLER!$G:$G)","v":100},{"$f":"IF(DN6>0,SUMIF(PLAN!$P:$P,\"D\"&CY6&\"-\"&$DI$1&\"-\"&$DA$1,PLAN!E:E),SUMIF(PLAN!$P:$P,\"D\"&\"-\"&$DI$1&\"-\"&$DA$1,PLAN!E:E))-SUMIF(GELİRLER!$H:$H,\"D\"&CY6&\"-\"&$DB$2&\"-\"&$DI$1&\"-\"&$DA$1,GELİRLER!$G:$G)","v":20},{"$f":"IF(DN6>0,SUMIF(PLAN!$P:$P,\"D\"&CY6&\"-\"&$DI$1&\"-\"&$DA$1,PLAN!F:F),SUMIF(PLAN!$P:$P,\"D\"&\"-\"&$DI$1&\"-\"&$DA$1,PLAN!F:F))-SUMIF(GELİRLER!$H:$H,\"D\"&CY6&\"-\"&$DC$2&\"-\"&$DI$1&\"-\"&$DA$1,GELİRLER!$G:$G)","v":45},{"$f":"IF(DN6>0,SUMIF(PLAN!$P:$P,\"D\"&CY6&\"-\"&$DI$1&\"-\"&$DA$1,PLAN!G:G),SUMIF(PLAN!$P:$P,\"D\"&\"-\"&$DI$1&\"-\"&$DA$1,PLAN!G:G))-SUMIF(GELİRLER!$H:$H,\"D\"&CY6&\"-\"&$DD$2&\"-\"&$DI$1&\"-\"&$DA$1,GELİRLER!$G:$G)","v":0},{"$f":"IF(DN6>0,SUMIF(PLAN!$P:$P,\"D\"&CY6&\"-\"&$DI$1&\"-\"&$DA$1,PLAN!H:H),SUMIF(PLAN!$P:$P,\"D\"&\"-\"&$DI$1&\"-\"&$DA$1,PLAN!H:H))-SUMIF(GELİRLER!$H:$H,\"D\"&CY6&\"-\"&$DE$2&\"-\"&$DI$1&\"-\"&$DA$1,GELİRLER!$G:$G)","v":0},{"$f":"IF(DN6>0,SUMIF(PLAN!$P:$P,\"D\"&CY6&\"-\"&$DI$1&\"-\"&$DA$1,PLAN!I:I),SUMIF(PLAN!$P:$P,\"D\"&\"-\"&$DI$1&\"-\"&$DA$1,PLAN!I:I))-SUMIF(GELİRLER!$H:$H,\"D\"&CY6&\"-\"&$DF$2&\"-\"&$DI$1&\"-\"&$DA$1,GELİRLER!$G:$G)","v":0},{"$f":"IF(DN6>0,SUMIF(PLAN!$P:$P,\"D\"&CY6&\"-\"&$DI$1&\"-\"&$DA$1,PLAN!J:J),SUMIF(PLAN!$P:$P,\"D\"&\"-\"&$DI$1&\"-\"&$DA$1,PLAN!J:J))-SUMIF(GELİRLER!$H:$H,\"D\"&CY6&\"-\"&$DG$2&\"-\"&$DI$1&\"-\"&$DA$1,GELİRLER!$G:$G)","v":0},{"$f":"IF(DN6>0,SUMIF(PLAN!$P:$P,\"D\"&CY6&\"-\"&$DI$1&\"-\"&$DA$1,PLAN!K:K),SUMIF(PLAN!$P:$P,\"D\"&\"-\"&$DI$1&\"-\"&$DA$1,PLAN!K:K))-SUMIF(GELİRLER!$H:$H,\"D\"&CY6&\"-\"&$DH$2&\"-\"&$DI$1&\"-\"&$DA$1,GELİRLER!$G:$G)","v":0},{"$f":"IF(DN6>0,SUMIF(PLAN!$P:$P,\"D\"&CY6&\"-\"&$DI$1&\"-\"&$DA$1,PLAN!L:L),SUMIF(PLAN!$P:$P,\"D\"&\"-\"&$DI$1&\"-\"&$DA$1,PLAN!L:L))-SUMIF(GELİRLER!$H:$H,\"D\"&CY6&\"-\"&$DI$2&\"-\"&$DI$1&\"-\"&$DA$1,GELİRLER!$G:$G)","v":0},{"$f":"IF(DN6>0,SUMIF(PLAN!$P:$P,\"D\"&CY6&\"-\"&$DI$1&\"-\"&$DA$1,PLAN!M:M),SUMIF(PLAN!$P:$P,\"D\"&\"-\"&$DI$1&\"-\"&$DA$1,PLAN!M:M))-SUMIF(GELİRLER!$H:$H,\"D\"&CY6&\"-\"&$DJ$2&\"-\"&$DI$1&\"-\"&$DA$1,GELİRLER!$G:$G)","v":0},{"$f":"IF(DN6>0,SUMIF(PLAN!$P:$P,\"D\"&CY6&\"-\"&$DI$1&\"-\"&$DA$1,PLAN!N:N),SUMIF(PLAN!$P:$P,\"D\"&\"-\"&$DI$1&\"-\"&$DA$1,PLAN!N:N))-SUMIF(GELİRLER!$H:$H,\"D\"&CY6&\"-\"&$DK$2&\"-\"&$DI$1&\"-\"&$DA$1,GELİRLER!$G:$G)","v":0},{"$f":"IF(DN6>0,SUMIF(PLAN!$P:$P,\"D\"&CY6&\"-\"&$DI$1&\"-\"&$DA$1,PLAN!O:O),SUMIF(PLAN!$P:$P,\"D\"&\"-\"&$DI$1&\"-\"&$DA$1,PLAN!O:O))-SUMIF(GELİRLER!$H:$H,\"D\"&CY6&\"-\"&$DL$2&\"-\"&$DI$1&\"-\"&$DA$1,GELİRLER!$G:$G)","v":0},{"$f":"\"D\"&CY6&\"-\"&$DI$1&\"-\"&$DA$1","v":"D4-2016-Aidat"},{"$f":"COUNTIF(PLAN!P:P,DM6)","v":0},{"$f":"COUNTIF(PLAN!P:P,\"D\"&CY6&\"-\"&$DI$1&\"-YAKIT\")","v":0},{"$f":"ROUND(SUMIF(YAKIT!$J:$J,\"D\"&CY6&\"-\"&$DA$2&\"-\"&$DI$1&\"-\"&\"YAKIT\",YAKIT!$I:$I)+IF(DO6>0,SUMIF(PLAN!$P:$P,\"D\"&CY6&\"-\"&$DI$1&\"-\"&\"YAKIT\",PLAN!D:D),SUMIF(PLAN!$P:$P,\"D\"&\"-\"&$DI$1&\"-\"&\"YAKIT\",PLAN!D:D))-SUMIF(GELİRLER!$H:$H,\"D\"&CY6&\"-\"&$DA$2&\"-\"&$DI$1&\"-\"&\"YAKIT\",GELİRLER!$G:$G),2)","v":0},{"$f":"ROUND(SUMIF(YAKIT!$J:$J,\"D\"&CY6&\"-\"&$DB$2&\"-\"&$DI$1&\"-\"&\"YAKIT\",YAKIT!$I:$I)+IF(DO6>0,SUMIF(PLAN!$P:$P,\"D\"&CY6&\"-\"&$DI$1&\"-\"&\"YAKIT\",PLAN!E:E),SUMIF(PLAN!$P:$P,\"D\"&\"-\"&$DI$1&\"-\"&\"YAKIT\",PLAN!E:E))-SUMIF(GELİRLER!$H:$H,\"D\"&CY6&\"-\"&$DB$2&\"-\"&$DI$1&\"-\"&\"YAKIT\",GELİRLER!$G:$G),2)","v":0},{"$f":"ROUND(SUMIF(YAKIT!$J:$J,\"D\"&CY6&\"-\"&$DC$2&\"-\"&$DI$1&\"-\"&\"YAKIT\",YAKIT!$I:$I)+IF(DO6>0,SUMIF(PLAN!$P:$P,\"D\"&CY6&\"-\"&$DI$1&\"-\"&\"YAKIT\",PLAN!F:F),SUMIF(PLAN!$P:$P,\"D\"&\"-\"&$DI$1&\"-\"&\"YAKIT\",PLAN!F:F))-SUMIF(GELİRLER!$H:$H,\"D\"&CY6&\"-\"&$DC$2&\"-\"&$DI$1&\"-\"&\"YAKIT\",GELİRLER!$G:$G),2)","v":0},{"$f":"ROUND(SUMIF(YAKIT!$J:$J,\"D\"&CY6&\"-\"&$DD$2&\"-\"&$DI$1&\"-\"&\"YAKIT\",YAKIT!$I:$I)+IF(DO6>0,SUMIF(PLAN!$P:$P,\"D\"&CY6&\"-\"&$DI$1&\"-\"&\"YAKIT\",PLAN!G:G),SUMIF(PLAN!$P:$P,\"D\"&\"-\"&$DI$1&\"-\"&\"YAKIT\",PLAN!G:G))-SUMIF(GELİRLER!$H:$H,\"D\"&CY6&\"-\"&$DD$2&\"-\"&$DI$1&\"-\"&\"YAKIT\",GELİRLER!$G:$G),2)","v":0},{"$f":"ROUND(SUMIF(YAKIT!$J:$J,\"D\"&CY6&\"-\"&$DE$2&\"-\"&$DI$1&\"-\"&\"YAKIT\",YAKIT!$I:$I)+IF(DO6>0,SUMIF(PLAN!$P:$P,\"D\"&CY6&\"-\"&$DI$1&\"-\"&\"YAKIT\",PLAN!H:H),SUMIF(PLAN!$P:$P,\"D\"&\"-\"&$DI$1&\"-\"&\"YAKIT\",PLAN!H:H))-SUMIF(GELİRLER!$H:$H,\"D\"&CY6&\"-\"&$DE$2&\"-\"&$DI$1&\"-\"&\"YAKIT\",GELİRLER!$G:$G),2)","v":0},{"$f":"ROUND(SUMIF(YAKIT!$J:$J,\"D\"&CY6&\"-\"&$DF$2&\"-\"&$DI$1&\"-\"&\"YAKIT\",YAKIT!$I:$I)+IF(DO6>0,SUMIF(PLAN!$P:$P,\"D\"&CY6&\"-\"&$DI$1&\"-\"&\"YAKIT\",PLAN!I:I),SUMIF(PLAN!$P:$P,\"D\"&\"-\"&$DI$1&\"-\"&\"YAKIT\",PLAN!I:I))-SUMIF(GELİRLER!$H:$H,\"D\"&CY6&\"-\"&$DF$2&\"-\"&$DI$1&\"-\"&\"YAKIT\",GELİRLER!$G:$G),2)","v":0},{"$f":"ROUND(SUMIF(YAKIT!$J:$J,\"D\"&CY6&\"-\"&$DG$2&\"-\"&$DI$1&\"-\"&\"YAKIT\",YAKIT!$I:$I)+IF(DO6>0,SUMIF(PLAN!$P:$P,\"D\"&CY6&\"-\"&$DI$1&\"-\"&\"YAKIT\",PLAN!J:J),SUMIF(PLAN!$P:$P,\"D\"&\"-\"&$DI$1&\"-\"&\"YAKIT\",PLAN!J:J))-SUMIF(GELİRLER!$H:$H,\"D\"&CY6&\"-\"&$DG$2&\"-\"&$DI$1&\"-\"&\"YAKIT\",GELİRLER!$G:$G),2)","v":0},{"$f":"ROUND(SUMIF(YAKIT!$J:$J,\"D\"&CY6&\"-\"&$DH$2&\"-\"&$DI$1&\"-\"&\"YAKIT\",YAKIT!$I:$I)+IF(DO6>0,SUMIF(PLAN!$P:$P,\"D\"&CY6&\"-\"&$DI$1&\"-\"&\"YAKIT\",PLAN!K:K),SUMIF(PLAN!$P:$P,\"D\"&\"-\"&$DI$1&\"-\"&\"YAKIT\",PLAN!K:K))-SUMIF(GELİRLER!$H:$H,\"D\"&CY6&\"-\"&$DH$2&\"-\"&$DI$1&\"-\"&\"YAKIT\",GELİRLER!$G:$G),2)","v":0},{"$f":"ROUND(SUMIF(YAKIT!$J:$J,\"D\"&CY6&\"-\"&$DI$2&\"-\"&$DI$1&\"-\"&\"YAKIT\",YAKIT!$I:$I)+IF(DO6>0,SUMIF(PLAN!$P:$P,\"D\"&CY6&\"-\"&$DI$1&\"-\"&\"YAKIT\",PLAN!L:L),SUMIF(PLAN!$P:$P,\"D\"&\"-\"&$DI$1&\"-\"&\"YAKIT\",PLAN!L:L))-SUMIF(GELİRLER!$H:$H,\"D\"&CY6&\"-\"&$DI$2&\"-\"&$DI$1&\"-\"&\"YAKIT\",GELİRLER!$G:$G),2)","v":0},{"$f":"ROUND(SUMIF(YAKIT!$J:$J,\"D\"&CY6&\"-\"&$DJ$2&\"-\"&$DI$1&\"-\"&\"YAKIT\",YAKIT!$I:$I)+IF(DO6>0,SUMIF(PLAN!$P:$P,\"D\"&CY6&\"-\"&$DI$1&\"-\"&\"YAKIT\",PLAN!M:M),SUMIF(PLAN!$P:$P,\"D\"&\"-\"&$DI$1&\"-\"&\"YAKIT\",PLAN!M:M))-SUMIF(GELİRLER!$H:$H,\"D\"&CY6&\"-\"&$DJ$2&\"-\"&$DI$1&\"-\"&\"YAKIT\",GELİRLER!$G:$G),2)","v":0},{"$f":"ROUND(SUMIF(YAKIT!$J:$J,\"D\"&CY6&\"-\"&$DK$2&\"-\"&$DI$1&\"-\"&\"YAKIT\",YAKIT!$I:$I)+IF(DO6>0,SUMIF(PLAN!$P:$P,\"D\"&CY6&\"-\"&$DI$1&\"-\"&\"YAKIT\",PLAN!N:N),SUMIF(PLAN!$P:$P,\"D\"&\"-\"&$DI$1&\"-\"&\"YAKIT\",PLAN!N:N))-SUMIF(GELİRLER!$H:$H,\"D\"&CY6&\"-\"&$DK$2&\"-\"&$DI$1&\"-\"&\"YAKIT\",GELİRLER!$G:$G),2)","v":0},{"$f":"ROUND(SUMIF(YAKIT!$J:$J,\"D\"&CY6&\"-\"&$DL$2&\"-\"&$DI$1&\"-\"&\"YAKIT\",YAKIT!$I:$I)+IF(DO6>0,SUMIF(PLAN!$P:$P,\"D\"&CY6&\"-\"&$DI$1&\"-\"&\"YAKIT\",PLAN!O:O),SUMIF(PLAN!$P:$P,\"D\"&\"-\"&$DI$1&\"-\"&\"YAKIT\",PLAN!O:O))-SUMIF(GELİRLER!$H:$H,\"D\"&CY6&\"-\"&$DL$2&\"-\"&$DI$1&\"-\"&\"YAKIT\",GELİRLER!$G:$G),2)","v":0}]
["TAHSİLAT",0,0,0,0,0,0,0,0,0,0,0,0,null,"OCAK","ŞUBAT","MART","NİSAN","MAYIS","HAZİRAN","TEMMUZ","AĞUSTOS","EYLÜL","EKİM","KASIM","ARALIK",null,null,null,null,null,null,null,null,null,null,null,null,null,null,null,null,null,null,null,null,null,null,null,null,null,null,null,null,null,null,null,null,null,null,null,null,null,null,null,null,null,null,null,null,null,null,{"$f":"IF(BU6=A2,BT9,IF(BU6=A6,BT13,IF(BU6=A10,BT17,IF(BU6=A14,BT21,IF(BU6=A18,BT25,\"\")))))","v":20},null,null,{"$f":"IF($BU$6=$A$2,A2,IF($BU$6=$A$6,A6,IF($BU$6=$A$10,A10,IF($BU$6=$A$14,A14,IF($BU$6=$A$18,A18,\"\")))))","v":"AİDAT"},100,20,45,0,0,0,0,0,0,0,0,0,null,null,null,null,null,null,null,null,null,null,null,null,null,null,{"$f":"IF(ÜYE!B6>\"\",ÜYE!A6,\"\")","v":5},{"$f":"IF(ÜYE!B6>\"\",ÜYE!A6&\"-\"&ÜYE!B6,\"\")","v":"5-Semra"},{"$f":"IF(DN7>0,SUMIF(PLAN!$P:$P,\"D\"&CY7&\"-\"&$DI$1&\"-\"&$DA$1,PLAN!D:D),SUMIF(PLAN!$P:$P,\"D\"&\"-\"&$DI$1&\"-\"&$DA$1,PLAN!D:D))-SUMIF(GELİRLER!$H:$H,\"D\"&CY7&\"-\"&$DA$2&\"-\"&$DI$1&\"-\"&$DA$1,GELİRLER!$G:$G)","v":100},{"$f":"IF(DN7>0,SUMIF(PLAN!$P:$P,\"D\"&CY7&\"-\"&$DI$1&\"-\"&$DA$1,PLAN!E:E),SUMIF(PLAN!$P:$P,\"D\"&\"-\"&$DI$1&\"-\"&$DA$1,PLAN!E:E))-SUMIF(GELİRLER!$H:$H,\"D\"&CY7&\"-\"&$DB$2&\"-\"&$DI$1&\"-\"&$DA$1,GELİRLER!$G:$G)","v":20},{"$f":"IF(DN7>0,SUMIF(PLAN!$P:$P,\"D\"&CY7&\"-\"&$DI$1&\"-\"&$DA$1,PLAN!F:F),SUMIF(PLAN!$P:$P,\"D\"&\"-\"&$DI$1&\"-\"&$DA$1,PLAN!F:F))-SUMIF(GELİRLER!$H:$H,\"D\"&CY7&\"-\"&$DC$2&\"-\"&$DI$1&\"-\"&$DA$1,GELİRLER!$G:$G)","v":45},{"$f":"IF(DN7>0,SUMIF(PLAN!$P:$P,\"D\"&CY7&\"-\"&$DI$1&\"-\"&$DA$1,PLAN!G:G),SUMIF(PLAN!$P:$P,\"D\"&\"-\"&$DI$1&\"-\"&$DA$1,PLAN!G:G))-SUMIF(GELİRLER!$H:$H,\"D\"&CY7&\"-\"&$DD$2&\"-\"&$DI$1&\"-\"&$DA$1,GELİRLER!$G:$G)","v":0},{"$f":"IF(DN7>0,SUMIF(PLAN!$P:$P,\"D\"&CY7&\"-\"&$DI$1&\"-\"&$DA$1,PLAN!H:H),SUMIF(PLAN!$P:$P,\"D\"&\"-\"&$DI$1&\"-\"&$DA$1,PLAN!H:H))-SUMIF(GELİRLER!$H:$H,\"D\"&CY7&\"-\"&$DE$2&\"-\"&$DI$1&\"-\"&$DA$1,GELİRLER!$G:$G)","v":0},{"$f":"IF(DN7>0,SUMIF(PLAN!$P:$P,\"D\"&CY7&\"-\"&$DI$1&\"-\"&$DA$1,PLAN!I:I),SUMIF(PLAN!$P:$P,\"D\"&\"-\"&$DI$1&\"-\"&$DA$1,PLAN!I:I))-SUMIF(GELİRLER!$H:$H,\"D\"&CY7&\"-\"&$DF$2&\"-\"&$DI$1&\"-\"&$DA$1,GELİRLER!$G:$G)","v":0},{"$f":"IF(DN7>0,SUMIF(PLAN!$P:$P,\"D\"&CY7&\"-\"&$DI$1&\"-\"&$DA$1,PLAN!J:J),SUMIF(PLAN!$P:$P,\"D\"&\"-\"&$DI$1&\"-\"&$DA$1,PLAN!J:J))-SUMIF(GELİRLER!$H:$H,\"D\"&CY7&\"-\"&$DG$2&\"-\"&$DI$1&\"-\"&$DA$1,GELİRLER!$G:$G)","v":0},{"$f":"IF(DN7>0,SUMIF(PLAN!$P:$P,\"D\"&CY7&\"-\"&$DI$1&\"-\"&$DA$1,PLAN!K:K),SUMIF(PLAN!$P:$P,\"D\"&\"-\"&$DI$1&\"-\"&$DA$1,PLAN!K:K))-SUMIF(GELİRLER!$H:$H,\"D\"&CY7&\"-\"&$DH$2&\"-\"&$DI$1&\"-\"&$DA$1,GELİRLER!$G:$G)","v":0},{"$f":"IF(DN7>0,SUMIF(PLAN!$P:$P,\"D\"&CY7&\"-\"&$DI$1&\"-\"&$DA$1,PLAN!L:L),SUMIF(PLAN!$P:$P,\"D\"&\"-\"&$DI$1&\"-\"&$DA$1,PLAN!L:L))-SUMIF(GELİRLER!$H:$H,\"D\"&CY7&\"-\"&$DI$2&\"-\"&$DI$1&\"-\"&$DA$1,GELİRLER!$G:$G)","v":0},{"$f":"IF(DN7>0,SUMIF(PLAN!$P:$P,\"D\"&CY7&\"-\"&$DI$1&\"-\"&$DA$1,PLAN!M:M),SUMIF(PLAN!$P:$P,\"D\"&\"-\"&$DI$1&\"-\"&$DA$1,PLAN!M:M))-SUMIF(GELİRLER!$H:$H,\"D\"&CY7&\"-\"&$DJ$2&\"-\"&$DI$1&\"-\"&$DA$1,GELİRLER!$G:$G)","v":0},{"$f":"IF(DN7>0,SUMIF(PLAN!$P:$P,\"D\"&CY7&\"-\"&$DI$1&\"-\"&$DA$1,PLAN!N:N),SUMIF(PLAN!$P:$P,\"D\"&\"-\"&$DI$1&\"-\"&$DA$1,PLAN!N:N))-SUMIF(GELİRLER!$H:$H,\"D\"&CY7&\"-\"&$DK$2&\"-\"&$DI$1&\"-\"&$DA$1,GELİRLER!$G:$G)","v":0},{"$f":"IF(DN7>0,SUMIF(PLAN!$P:$P,\"D\"&CY7&\"-\"&$DI$1&\"-\"&$DA$1,PLAN!O:O),SUMIF(PLAN!$P:$P,\"D\"&\"-\"&$DI$1&\"-\"&$DA$1,PLAN!O:O))-SUMIF(GELİRLER!$H:$H,\"D\"&CY7&\"-\"&$DL$2&\"-\"&$DI$1&\"-\"&$DA$1,GELİRLER!$G:$G)","v":0},"D5-2016-Aidat",{"$f":"COUNTIF(PLAN!P:P,DM7)","v":0},{"$f":"COUNTIF(PLAN!P:P,\"D\"&CY7&\"-\"&$DI$1&\"-YAKIT\")","v":0},{"$f":"ROUND(SUMIF(YAKIT!$J:$J,\"D\"&CY7&\"-\"&$DA$2&\"-\"&$DI$1&\"-\"&\"YAKIT\",YAKIT!$I:$I)+IF(DO7>0,SUMIF(PLAN!$P:$P,\"D\"&CY7&\"-\"&$DI$1&\"-\"&\"YAKIT\",PLAN!D:D),SUMIF(PLAN!$P:$P,\"D\"&\"-\"&$DI$1&\"-\"&\"YAKIT\",PLAN!D:D))-SUMIF(GELİRLER!$H:$H,\"D\"&CY7&\"-\"&$DA$2&\"-\"&$DI$1&\"-\"&\"YAKIT\",GELİRLER!$G:$G),2)","v":0},{"$f":"ROUND(SUMIF(YAKIT!$J:$J,\"D\"&CY7&\"-\"&$DB$2&\"-\"&$DI$1&\"-\"&\"YAKIT\",YAKIT!$I:$I)+IF(DO7>0,SUMIF(PLAN!$P:$P,\"D\"&CY7&\"-\"&$DI$1&\"-\"&\"YAKIT\",PLAN!E:E),SUMIF(PLAN!$P:$P,\"D\"&\"-\"&$DI$1&\"-\"&\"YAKIT\",PLAN!E:E))-SUMIF(GELİRLER!$H:$H,\"D\"&CY7&\"-\"&$DB$2&\"-\"&$DI$1&\"-\"&\"YAKIT\",GELİRLER!$G:$G),2)","v":0},{"$f":"ROUND(SUMIF(YAKIT!$J:$J,\"D\"&CY7&\"-\"&$DC$2&\"-\"&$DI$1&\"-\"&\"YAKIT\",YAKIT!$I:$I)+IF(DO7>0,SUMIF(PLAN!$P:$P,\"D\"&CY7&\"-\"&$DI$1&\"-\"&\"YAKIT\",PLAN!F:F),SUMIF(PLAN!$P:$P,\"D\"&\"-\"&$DI$1&\"-\"&\"YAKIT\",PLAN!F:F))-SUMIF(GELİRLER!$H:$H,\"D\"&CY7&\"-\"&$DC$2&\"-\"&$DI$1&\"-\"&\"YAKIT\",GELİRLER!$G:$G),2)","v":0},{"$f":"ROUND(SUMIF(YAKIT!$J:$J,\"D\"&CY7&\"-\"&$DD$2&\"-\"&$DI$1&\"-\"&\"YAKIT\",YAKIT!$I:$I)+IF(DO7>0,SUMIF(PLAN!$P:$P,\"D\"&CY7&\"-\"&$DI$1&\"-\"&\"YAKIT\",PLAN!G:G),SUMIF(PLAN!$P:$P,\"D\"&\"-\"&$DI$1&\"-\"&\"YAKIT\",PLAN!G:G))-SUMIF(GELİRLER!$H:$H,\"D\"&CY7&\"-\"&$DD$2&\"-\"&$DI$1&\"-\"&\"YAKIT\",GELİRLER!$G:$G),2)","v":0},{"$f":"ROUND(SUMIF(YAKIT!$J:$J,\"D\"&CY7&\"-\"&$DE$2&\"-\"&$DI$1&\"-\"&\"YAKIT\",YAKIT!$I:$I)+IF(DO7>0,SUMIF(PLAN!$P:$P,\"D\"&CY7&\"-\"&$DI$1&\"-\"&\"YAKIT\",PLAN!H:H),SUMIF(PLAN!$P:$P,\"D\"&\"-\"&$DI$1&\"-\"&\"YAKIT\",PLAN!H:H))-SUMIF(GELİRLER!$H:$H,\"D\"&CY7&\"-\"&$DE$2&\"-\"&$DI$1&\"-\"&\"YAKIT\",GELİRLER!$G:$G),2)","v":0},{"$f":"ROUND(SUMIF(YAKIT!$J:$J,\"D\"&CY7&\"-\"&$DF$2&\"-\"&$DI$1&\"-\"&\"YAKIT\",YAKIT!$I:$I)+IF(DO7>0,SUMIF(PLAN!$P:$P,\"D\"&CY7&\"-\"&$DI$1&\"-\"&\"YAKIT\",PLAN!I:I),SUMIF(PLAN!$P:$P,\"D\"&\"-\"&$DI$1&\"-\"&\"YAKIT\",PLAN!I:I))-SUMIF(GELİRLER!$H:$H,\"D\"&CY7&\"-\"&$DF$2&\"-\"&$DI$1&\"-\"&\"YAKIT\",GELİRLER!$G:$G),2)","v":0},{"$f":"ROUND(SUMIF(YAKIT!$J:$J,\"D\"&CY7&\"-\"&$DG$2&\"-\"&$DI$1&\"-\"&\"YAKIT\",YAKIT!$I:$I)+IF(DO7>0,SUMIF(PLAN!$P:$P,\"D\"&CY7&\"-\"&$DI$1&\"-\"&\"YAKIT\",PLAN!J:J),SUMIF(PLAN!$P:$P,\"D\"&\"-\"&$DI$1&\"-\"&\"YAKIT\",PLAN!J:J))-SUMIF(GELİRLER!$H:$H,\"D\"&CY7&\"-\"&$DG$2&\"-\"&$DI$1&\"-\"&\"YAKIT\",GELİRLER!$G:$G),2)","v":0},{"$f":"ROUND(SUMIF(YAKIT!$J:$J,\"D\"&CY7&\"-\"&$DH$2&\"-\"&$DI$1&\"-\"&\"YAKIT\",YAKIT!$I:$I)+IF(DO7>0,SUMIF(PLAN!$P:$P,\"D\"&CY7&\"-\"&$DI$1&\"-\"&\"YAKIT\",PLAN!K:K),SUMIF(PLAN!$P:$P,\"D\"&\"-\"&$DI$1&\"-\"&\"YAKIT\",PLAN!K:K))-SUMIF(GELİRLER!$H:$H,\"D\"&CY7&\"-\"&$DH$2&\"-\"&$DI$1&\"-\"&\"YAKIT\",GELİRLER!$G:$G),2)","v":0},{"$f":"ROUND(SUMIF(YAKIT!$J:$J,\"D\"&CY7&\"-\"&$DI$2&\"-\"&$DI$1&\"-\"&\"YAKIT\",YAKIT!$I:$I)+IF(DO7>0,SUMIF(PLAN!$P:$P,\"D\"&CY7&\"-\"&$DI$1&\"-\"&\"YAKIT\",PLAN!L:L),SUMIF(PLAN!$P:$P,\"D\"&\"-\"&$DI$1&\"-\"&\"YAKIT\",PLAN!L:L))-SUMIF(GELİRLER!$H:$H,\"D\"&CY7&\"-\"&$DI$2&\"-\"&$DI$1&\"-\"&\"YAKIT\",GELİRLER!$G:$G),2)","v":0},{"$f":"ROUND(SUMIF(YAKIT!$J:$J,\"D\"&CY7&\"-\"&$DJ$2&\"-\"&$DI$1&\"-\"&\"YAKIT\",YAKIT!$I:$I)+IF(DO7>0,SUMIF(PLAN!$P:$P,\"D\"&CY7&\"-\"&$DI$1&\"-\"&\"YAKIT\",PLAN!M:M),SUMIF(PLAN!$P:$P,\"D\"&\"-\"&$DI$1&\"-\"&\"YAKIT\",PLAN!M:M))-SUMIF(GELİRLER!$H:$H,\"D\"&CY7&\"-\"&$DJ$2&\"-\"&$DI$1&\"-\"&\"YAKIT\",GELİRLER!$G:$G),2)","v":0},{"$f":"ROUND(SUMIF(YAKIT!$J:$J,\"D\"&CY7&\"-\"&$DK$2&\"-\"&$DI$1&\"-\"&\"YAKIT\",YAKIT!$I:$I)+IF(DO7>0,SUMIF(PLAN!$P:$P,\"D\"&CY7&\"-\"&$DI$1&\"-\"&\"YAKIT\",PLAN!N:N),SUMIF(PLAN!$P:$P,\"D\"&\"-\"&$DI$1&\"-\"&\"YAKIT\",PLAN!N:N))-SUMIF(GELİRLER!$H:$H,\"D\"&CY7&\"-\"&$DK$2&\"-\"&$DI$1&\"-\"&\"YAKIT\",GELİRLER!$G:$G),2)","v":0},{"$f":"ROUND(SUMIF(YAKIT!$J:$J,\"D\"&CY7&\"-\"&$DL$2&\"-\"&$DI$1&\"-\"&\"YAKIT\",YAKIT!$I:$I)+IF(DO7>0,SUMIF(PLAN!$P:$P,\"D\"&CY7&\"-\"&$DI$1&\"-\"&\"YAKIT\",PLAN!O:O),SUMIF(PLAN!$P:$P,\"D\"&\"-\"&$DI$1&\"-\"&\"YAKIT\",PLAN!O:O))-SUMIF(GELİRLER!$H:$H,\"D\"&CY7&\"-\"&$DL$2&\"-\"&$DI$1&\"-\"&\"YAKIT\",GELİRLER!$G:$G),2)","v":0}]
["KALAN",0,0,0,0,0,0,0,0,0,0,0,0,"BORÇLANDIRMA",{"$f":"IF($Y6>0,SUMIF(PLAN!$P:$P,\"D\"&X6&\"-\"&W6&\"-\"&O6,PLAN!$D:$D),SUMIF(PLAN!$P:$P,\"D\"&\"-\"&W6&\"-\"&O6,PLAN!$D:$D))","v":100},{"$f":"IF($Y$6>0,SUMIF(PLAN!$P:$P,\"D\"&$X$6&\"-\"&$W$6&\"-\"&$O$6,PLAN!E:E),SUMIF(PLAN!$P:$P,\"D\"&\"-\"&$W$6&\"-\"&$O$6,PLAN!E:E))","v":20},{"$f":"IF($Y$6>0,SUMIF(PLAN!$P:$P,\"D\"&$X$6&\"-\"&$W$6&\"-\"&$O$6,PLAN!F:F),SUMIF(PLAN!$P:$P,\"D\"&\"-\"&$W$6&\"-\"&$O$6,PLAN!F:F))","v":45},{"$f":"IF($Y$6>0,SUMIF(PLAN!$P:$P,\"D\"&$X$6&\"-\"&$W$6&\"-\"&$O$6,PLAN!G:G),SUMIF(PLAN!$P:$P,\"D\"&\"-\"&$W$6&\"-\"&$O$6,PLAN!G:G))","v":0},{"$f":"IF($Y$6>0,SUMIF(PLAN!$P:$P,\"D\"&$X$6&\"-\"&$W$6&\"-\"&$O$6,PLAN!H:H),SUMIF(PLAN!$P:$P,\"D\"&\"-\"&$W$6&\"-\"&$O$6,PLAN!H:H))","v":0},{"$f":"IF($Y$6>0,SUMIF(PLAN!$P:$P,\"D\"&$X$6&\"-\"&$W$6&\"-\"&$O$6,PLAN!I:I),SUMIF(PLAN!$P:$P,\"D\"&\"-\"&$W$6&\"-\"&$O$6,PLAN!I:I))","v":0},{"$f":"IF($Y$6>0,SUMIF(PLAN!$P:$P,\"D\"&$X$6&\"-\"&$W$6&\"-\"&$O$6,PLAN!J:J),SUMIF(PLAN!$P:$P,\"D\"&\"-\"&$W$6&\"-\"&$O$6,PLAN!J:J))","v":0},{"$f":"IF($Y$6>0,SUMIF(PLAN!$P:$P,\"D\"&$X$6&\"-\"&$W$6&\"-\"&$O$6,PLAN!K:K),SUMIF(PLAN!$P:$P,\"D\"&\"-\"&$W$6&\"-\"&$O$6,PLAN!K:K))","v":0},{"$f":"IF($Y$6>0,SUMIF(PLAN!$P:$P,\"D\"&$X$6&\"-\"&$W$6&\"-\"&$O$6,PLAN!L:L),SUMIF(PLAN!$P:$P,\"D\"&\"-\"&$W$6&\"-\"&$O$6,PLAN!L:L))","v":0},{"$f":"IF($Y$6>0,SUMIF(PLAN!$P:$P,\"D\"&$X$6&\"-\"&$W$6&\"-\"&$O$6,PLAN!M:M),SUMIF(PLAN!$P:$P,\"D\"&\"-\"&$W$6&\"-\"&$O$6,PLAN!M:M))","v":0},{"$f":"IF($Y$6>0,SUMIF(PLAN!$P:$P,\"D\"&$X$6&\"-\"&$W$6&\"-\"&$O$6,PLAN!N:N),SUMIF(PLAN!$P:$P,\"D\"&\"-\"&$W$6&\"-\"&$O$6,PLAN!N:N))","v":0},{"$f":"IF($Y$6>0,SUMIF(PLAN!$P:$P,\"D\"&$X$6&\"-\"&$W$6&\"-\"&$O$6,PLAN!O:O),SUMIF(PLAN!$P:$P,\"D\"&\"-\"&$W$6&\"-\"&$O$6,PLAN!O:O))","v":0},null,null,null,null,null,null,null,null,null,null,null,null,null,null,null,null,null,null,null,null,null,null,null,null,null,null,null,null,null,null,null,null,null,null,null,null,null,null,null,null,null,null,null,null,null,null,null,null,null,"TAHSİLAT",{"$f":"IF($BU$6=$A$2,B3,IF($BU$6=$A$6,B7,IF($BU$6=$A$10,B11,IF($BU$6=$A$14,B15,IF($BU$6=$A$18,B19,\"\")))))","v":0},0,0,0,0,0,0,0,0,0,0,0,null,null,null,null,null,null,null,null,null,null,null,null,null,null,{"$f":"IF(ÜYE!B7>\"\",ÜYE!A7,\"\")","v":6},{"$f":"IF(ÜYE!B7>\"\",ÜYE!A7&\"-\"&ÜYE!B7,\"\")","v":"6-Yağız"},{"$f":"IF(DN8>0,SUMIF(PLAN!$P:$P,\"D\"&CY8&\"-\"&$DI$1&\"-\"&$DA$1,PLAN!D:D),SUMIF(PLAN!$P:$P,\"D\"&\"-\"&$DI$1&\"-\"&$DA$1,PLAN!D:D))-SUMIF(GELİRLER!$H:$H,\"D\"&CY8&\"-\"&$DA$2&\"-\"&$DI$1&\"-\"&$DA$1,GELİRLER!$G:$G)","v":100},{"$f":"IF(DN8>0,SUMIF(PLAN!$P:$P,\"D\"&CY8&\"-\"&$DI$1&\"-\"&$DA$1,PLAN!E:E),SUMIF(PLAN!$P:$P,\"D\"&\"-\"&$DI$1&\"-\"&$DA$1,PLAN!E:E))-SUMIF(GELİRLER!$H:$H,\"D\"&CY8&\"-\"&$DB$2&\"-\"&$DI$1&\"-\"&$DA$1,GELİRLER!$G:$G)","v":20},{"$f":"IF(DN8>0,SUMIF(PLAN!$P:$P,\"D\"&CY8&\"-\"&$DI$1&\"-\"&$DA$1,PLAN!F:F),SUMIF(PLAN!$P:$P,\"D\"&\"-\"&$DI$1&\"-\"&$DA$1,PLAN!F:F))-SUMIF(GELİRLER!$H:$H,\"D\"&CY8&\"-\"&$DC$2&\"-\"&$DI$1&\"-\"&$DA$1,GELİRLER!$G:$G)","v":45},{"$f":"IF(DN8>0,SUMIF(PLAN!$P:$P,\"D\"&CY8&\"-\"&$DI$1&\"-\"&$DA$1,PLAN!G:G),SUMIF(PLAN!$P:$P,\"D\"&\"-\"&$DI$1&\"-\"&$DA$1,PLAN!G:G))-SUMIF(GELİRLER!$H:$H,\"D\"&CY8&\"-\"&$DD$2&\"-\"&$DI$1&\"-\"&$DA$1,GELİRLER!$G:$G)","v":0},{"$f":"IF(DN8>0,SUMIF(PLAN!$P:$P,\"D\"&CY8&\"-\"&$DI$1&\"-\"&$DA$1,PLAN!H:H),SUMIF(PLAN!$P:$P,\"D\"&\"-\"&$DI$1&\"-\"&$DA$1,PLAN!H:H))-SUMIF(GELİRLER!$H:$H,\"D\"&CY8&\"-\"&$DE$2&\"-\"&$DI$1&\"-\"&$DA$1,GELİRLER!$G:$G)","v":0},{"$f":"IF(DN8>0,SUMIF(PLAN!$P:$P,\"D\"&CY8&\"-\"&$DI$1&\"-\"&$DA$1,PLAN!I:I),SUMIF(PLAN!$P:$P,\"D\"&\"-\"&$DI$1&\"-\"&$DA$1,PLAN!I:I))-SUMIF(GELİRLER!$H:$H,\"D\"&CY8&\"-\"&$DF$2&\"-\"&$DI$1&\"-\"&$DA$1,GELİRLER!$G:$G)","v":0},{"$f":"IF(DN8>0,SUMIF(PLAN!$P:$P,\"D\"&CY8&\"-\"&$DI$1&\"-\"&$DA$1,PLAN!J:J),SUMIF(PLAN!$P:$P,\"D\"&\"-\"&$DI$1&\"-\"&$DA$1,PLAN!J:J))-SUMIF(GELİRLER!$H:$H,\"D\"&CY8&\"-\"&$DG$2&\"-\"&$DI$1&\"-\"&$DA$1,GELİRLER!$G:$G)","v":0},{"$f":"IF(DN8>0,SUMIF(PLAN!$P:$P,\"D\"&CY8&\"-\"&$DI$1&\"-\"&$DA$1,PLAN!K:K),SUMIF(PLAN!$P:$P,\"D\"&\"-\"&$DI$1&\"-\"&$DA$1,PLAN!K:K))-SUMIF(GELİRLER!$H:$H,\"D\"&CY8&\"-\"&$DH$2&\"-\"&$DI$1&\"-\"&$DA$1,GELİRLER!$G:$G)","v":0},{"$f":"IF(DN8>0,SUMIF(PLAN!$P:$P,\"D\"&CY8&\"-\"&$DI$1&\"-\"&$DA$1,PLAN!L:L),SUMIF(PLAN!$P:$P,\"D\"&\"-\"&$DI$1&\"-\"&$DA$1,PLAN!L:L))-SUMIF(GELİRLER!$H:$H,\"D\"&CY8&\"-\"&$DI$2&\"-\"&$DI$1&\"-\"&$DA$1,GELİRLER!$G:$G)","v":0},{"$f":"IF(DN8>0,SUMIF(PLAN!$P:$P,\"D\"&CY8&\"-\"&$DI$1&\"-\"&$DA$1,PLAN!M:M),SUMIF(PLAN!$P:$P,\"D\"&\"-\"&$DI$1&\"-\"&$DA$1,PLAN!M:M))-SUMIF(GELİRLER!$H:$H,\"D\"&CY8&\"-\"&$DJ$2&\"-\"&$DI$1&\"-\"&$DA$1,GELİRLER!$G:$G)","v":0},{"$f":"IF(DN8>0,SUMIF(PLAN!$P:$P,\"D\"&CY8&\"-\"&$DI$1&\"-\"&$DA$1,PLAN!N:N),SUMIF(PLAN!$P:$P,\"D\"&\"-\"&$DI$1&\"-\"&$DA$1,PLAN!N:N))-SUMIF(GELİRLER!$H:$H,\"D\"&CY8&\"-\"&$DK$2&\"-\"&$DI$1&\"-\"&$DA$1,GELİRLER!$G:$G)","v":0},{"$f":"IF(DN8>0,SUMIF(PLAN!$P:$P,\"D\"&CY8&\"-\"&$DI$1&\"-\"&$DA$1,PLAN!O:O),SUMIF(PLAN!$P:$P,\"D\"&\"-\"&$DI$1&\"-\"&$DA$1,PLAN!O:O))-SUMIF(GELİRLER!$H:$H,\"D\"&CY8&\"-\"&$DL$2&\"-\"&$DI$1&\"-\"&$DA$1,GELİRLER!$G:$G)","v":0},"D6-2016-Aidat",{"$f":"COUNTIF(PLAN!P:P,DM8)","v":0},{"$f":"COUNTIF(PLAN!P:P,\"D\"&CY8&\"-\"&$DI$1&\"-YAKIT\")","v":0},{"$f":"ROUND(SUMIF(YAKIT!$J:$J,\"D\"&CY8&\"-\"&$DA$2&\"-\"&$DI$1&\"-\"&\"YAKIT\",YAKIT!$I:$I)+IF(DO8>0,SUMIF(PLAN!$P:$P,\"D\"&CY8&\"-\"&$DI$1&\"-\"&\"YAKIT\",PLAN!D:D),SUMIF(PLAN!$P:$P,\"D\"&\"-\"&$DI$1&\"-\"&\"YAKIT\",PLAN!D:D))-SUMIF(GELİRLER!$H:$H,\"D\"&CY8&\"-\"&$DA$2&\"-\"&$DI$1&\"-\"&\"YAKIT\",GELİRLER!$G:$G),2)","v":0},{"$f":"ROUND(SUMIF(YAKIT!$J:$J,\"D\"&CY8&\"-\"&$DB$2&\"-\"&$DI$1&\"-\"&\"YAKIT\",YAKIT!$I:$I)+IF(DO8>0,SUMIF(PLAN!$P:$P,\"D\"&CY8&\"-\"&$DI$1&\"-\"&\"YAKIT\",PLAN!E:E),SUMIF(PLAN!$P:$P,\"D\"&\"-\"&$DI$1&\"-\"&\"YAKIT\",PLAN!E:E))-SUMIF(GELİRLER!$H:$H,\"D\"&CY8&\"-\"&$DB$2&\"-\"&$DI$1&\"-\"&\"YAKIT\",GELİRLER!$G:$G),2)","v":0},{"$f":"ROUND(SUMIF(YAKIT!$J:$J,\"D\"&CY8&\"-\"&$DC$2&\"-\"&$DI$1&\"-\"&\"YAKIT\",YAKIT!$I:$I)+IF(DO8>0,SUMIF(PLAN!$P:$P,\"D\"&CY8&\"-\"&$DI$1&\"-\"&\"YAKIT\",PLAN!F:F),SUMIF(PLAN!$P:$P,\"D\"&\"-\"&$DI$1&\"-\"&\"YAKIT\",PLAN!F:F))-SUMIF(GELİRLER!$H:$H,\"D\"&CY8&\"-\"&$DC$2&\"-\"&$DI$1&\"-\"&\"YAKIT\",GELİRLER!$G:$G),2)","v":0},{"$f":"ROUND(SUMIF(YAKIT!$J:$J,\"D\"&CY8&\"-\"&$DD$2&\"-\"&$DI$1&\"-\"&\"YAKIT\",YAKIT!$I:$I)+IF(DO8>0,SUMIF(PLAN!$P:$P,\"D\"&CY8&\"-\"&$DI$1&\"-\"&\"YAKIT\",PLAN!G:G),SUMIF(PLAN!$P:$P,\"D\"&\"-\"&$DI$1&\"-\"&\"YAKIT\",PLAN!G:G))-SUMIF(GELİRLER!$H:$H,\"D\"&CY8&\"-\"&$DD$2&\"-\"&$DI$1&\"-\"&\"YAKIT\",GELİRLER!$G:$G),2)","v":0},{"$f":"ROUND(SUMIF(YAKIT!$J:$J,\"D\"&CY8&\"-\"&$DE$2&\"-\"&$DI$1&\"-\"&\"YAKIT\",YAKIT!$I:$I)+IF(DO8>0,SUMIF(PLAN!$P:$P,\"D\"&CY8&\"-\"&$DI$1&\"-\"&\"YAKIT\",PLAN!H:H),SUMIF(PLAN!$P:$P,\"D\"&\"-\"&$DI$1&\"-\"&\"YAKIT\",PLAN!H:H))-SUMIF(GELİRLER!$H:$H,\"D\"&CY8&\"-\"&$DE$2&\"-\"&$DI$1&\"-\"&\"YAKIT\",GELİRLER!$G:$G),2)","v":0},{"$f":"ROUND(SUMIF(YAKIT!$J:$J,\"D\"&CY8&\"-\"&$DF$2&\"-\"&$DI$1&\"-\"&\"YAKIT\",YAKIT!$I:$I)+IF(DO8>0,SUMIF(PLAN!$P:$P,\"D\"&CY8&\"-\"&$DI$1&\"-\"&\"YAKIT\",PLAN!I:I),SUMIF(PLAN!$P:$P,\"D\"&\"-\"&$DI$1&\"-\"&\"YAKIT\",PLAN!I:I))-SUMIF(GELİRLER!$H:$H,\"D\"&CY8&\"-\"&$DF$2&\"-\"&$DI$1&\"-\"&\"YAKIT\",GELİRLER!$G:$G),2)","v":0},{"$f":"ROUND(SUMIF(YAKIT!$J:$J,\"D\"&CY8&\"-\"&$DG$2&\"-\"&$DI$1&\"-\"&\"YAKIT\",YAKIT!$I:$I)+IF(DO8>0,SUMIF(PLAN!$P:$P,\"D\"&CY8&\"-\"&$DI$1&\"-\"&\"YAKIT\",PLAN!J:J),SUMIF(PLAN!$P:$P,\"D\"&\"-\"&$DI$1&\"-\"&\"YAKIT\",PLAN!J:J))-SUMIF(GELİRLER!$H:$H,\"D\"&CY8&\"-\"&$DG$2&\"-\"&$DI$1&\"-\"&\"YAKIT\",GELİRLER!$G:$G),2)","v":0},{"$f":"ROUND(SUMIF(YAKIT!$J:$J,\"D\"&CY8&\"-\"&$DH$2&\"-\"&$DI$1&\"-\"&\"YAKIT\",YAKIT!$I:$I)+IF(DO8>0,SUMIF(PLAN!$P:$P,\"D\"&CY8&\"-\"&$DI$1&\"-\"&\"YAKIT\",PLAN!K:K),SUMIF(PLAN!$P:$P,\"D\"&\"-\"&$DI$1&\"-\"&\"YAKIT\",PLAN!K:K))-SUMIF(GELİRLER!$H:$H,\"D\"&CY8&\"-\"&$DH$2&\"-\"&$DI$1&\"-\"&\"YAKIT\",GELİRLER!$G:$G),2)","v":0},{"$f":"ROUND(SUMIF(YAKIT!$J:$J,\"D\"&CY8&\"-\"&$DI$2&\"-\"&$DI$1&\"-\"&\"YAKIT\",YAKIT!$I:$I)+IF(DO8>0,SUMIF(PLAN!$P:$P,\"D\"&CY8&\"-\"&$DI$1&\"-\"&\"YAKIT\",PLAN!L:L),SUMIF(PLAN!$P:$P,\"D\"&\"-\"&$DI$1&\"-\"&\"YAKIT\",PLAN!L:L))-SUMIF(GELİRLER!$H:$H,\"D\"&CY8&\"-\"&$DI$2&\"-\"&$DI$1&\"-\"&\"YAKIT\",GELİRLER!$G:$G),2)","v":0},{"$f":"ROUND(SUMIF(YAKIT!$J:$J,\"D\"&CY8&\"-\"&$DJ$2&\"-\"&$DI$1&\"-\"&\"YAKIT\",YAKIT!$I:$I)+IF(DO8>0,SUMIF(PLAN!$P:$P,\"D\"&CY8&\"-\"&$DI$1&\"-\"&\"YAKIT\",PLAN!M:M),SUMIF(PLAN!$P:$P,\"D\"&\"-\"&$DI$1&\"-\"&\"YAKIT\",PLAN!M:M))-SUMIF(GELİRLER!$H:$H,\"D\"&CY8&\"-\"&$DJ$2&\"-\"&$DI$1&\"-\"&\"YAKIT\",GELİRLER!$G:$G),2)","v":0},{"$f":"ROUND(SUMIF(YAKIT!$J:$J,\"D\"&CY8&\"-\"&$DK$2&\"-\"&$DI$1&\"-\"&\"YAKIT\",YAKIT!$I:$I)+IF(DO8>0,SUMIF(PLAN!$P:$P,\"D\"&CY8&\"-\"&$DI$1&\"-\"&\"YAKIT\",PLAN!N:N),SUMIF(PLAN!$P:$P,\"D\"&\"-\"&$DI$1&\"-\"&\"YAKIT\",PLAN!N:N))-SUMIF(GELİRLER!$H:$H,\"D\"&CY8&\"-\"&$DK$2&\"-\"&$DI$1&\"-\"&\"YAKIT\",GELİRLER!$G:$G),2)","v":0},{"$f":"ROUND(SUMIF(YAKIT!$J:$J,\"D\"&CY8&\"-\"&$DL$2&\"-\"&$DI$1&\"-\"&\"YAKIT\",YAKIT!$I:$I)+IF(DO8>0,SUMIF(PLAN!$P:$P,\"D\"&CY8&\"-\"&$DI$1&\"-\"&\"YAKIT\",PLAN!O:O),SUMIF(PLAN!$P:$P,\"D\"&\"-\"&$DI$1&\"-\"&\"YAKIT\",PLAN!O:O))-SUMIF(GELİRLER!$H:$H,\"D\"&CY8&\"-\"&$DL$2&\"-\"&$DI$1&\"-\"&\"YAKIT\",GELİRLER!$G:$G),2)","v":0}]
[null,null,null,null,null,null,null,null,null,null,null,null,null,"TAHSİLAT",{"$f":"SUMIF(GELİRLER!$H:$H,\"D\"&$X$6&\"-\"&O7&\"-\"&$W$6&\"-\"&$O$6,GELİRLER!$G:$G)","v":0},{"$f":"SUMIF(GELİRLER!$H:$H,\"D\"&$X$6&\"-\"&P7&\"-\"&$W$6&\"-\"&$O$6,GELİRLER!$G:$G)","v":0},{"$f":"SUMIF(GELİRLER!$H:$H,\"D\"&$X$6&\"-\"&Q7&\"-\"&$W$6&\"-\"&$O$6,GELİRLER!$G:$G)","v":0},{"$f":"SUMIF(GELİRLER!$H:$H,\"D\"&$X$6&\"-\"&R7&\"-\"&$W$6&\"-\"&$O$6,GELİRLER!$G:$G)","v":0},{"$f":"SUMIF(GELİRLER!$H:$H,\"D\"&$X$6&\"-\"&S7&\"-\"&$W$6&\"-\"&$O$6,GELİRLER!$G:$G)","v":0},{"$f":"SUMIF(GELİRLER!$H:$H,\"D\"&$X$6&\"-\"&T7&\"-\"&$W$6&\"-\"&$O$6,GELİRLER!$G:$G)","v":0},{"$f":"SUMIF(GELİRLER!$H:$H,\"D\"&$X$6&\"-\"&U7&\"-\"&$W$6&\"-\"&$O$6,GELİRLER!$G:$G)","v":0},{"$f":"SUMIF(GELİRLER!$H:$H,\"D\"&$X$6&\"-\"&V7&\"-\"&$W$6&\"-\"&$O$6,GELİRLER!$G:$G)","v":0},{"$f":"SUMIF(GELİRLER!$H:$H,\"D\"&$X$6&\"-\"&W7&\"-\"&$W$6&\"-\"&$O$6,GELİRLER!$G:$G)","v":0},{"$f":"SUMIF(GELİRLER!$H:$H,\"D\"&$X$6&\"-\"&X7&\"-\"&$W$6&\"-\"&$O$6,GELİRLER!$G:$G)","v":0},{"$f":"SUMIF(GELİRLER!$H:$H,\"D\"&$X$6&\"-\"&Y7&\"-\"&$W$6&\"-\"&$O$6,GELİRLER!$G:$G)","v":0},{"$f":"SUMIF(GELİRLER!$H:$H,\"D\"&$X$6&\"-\"&Z7&\"-\"&$W$6&\"-\"&$O$6,GELİRLER!$G:$G)","v":0},null,null,null,null,null,null,null,null,null,null,null,null,null,null,null,null,null,null,null,null,null,null,null,null,null,null,null,null,null,null,null,null,null,null,null,null,null,null,null,null,null,null,null,null,null,{"$f":"IF($BT$6=$B$1,B4,IF($BT$6=$C$1,C4,IF($BT$6=$D$1,D4,IF($BT$6=$E$1,E4,IF($BT$6=$F$1,F4,IF($BT$6=$G$1,G4,BU9))))))","v":20},{"$f":"IF($BT$6=$H$1,H4,IF($BT$6=$I$1,I4,IF($BT$6=$J$1,J4,IF($BT$6=$K$1,K4,IF($BT$6=$L$1,L4,IF($BT$6=$M$1,M4,\"\"))))))","v":""},null,null,"KALAN",100,20,45,0,0,0,0,0,0,0,0,0,null,null,null,null,null,null,null,null,null,null,null,null,null,null,{"$f":"IF(ÜYE!B8>\"\",ÜYE!A8,\"\")","v":7},{"$f":"IF(ÜYE!B8>\"\",ÜYE!A8&\"-\"&ÜYE!B8,\"\")","v":"7-İlyas"},{"$f":"IF(DN9>0,SUMIF(PLAN!$P:$P,\"D\"&CY9&\"-\"&$DI$1&\"-\"&$DA$1,PLAN!D:D),SUMIF(PLAN!$P:$P,\"D\"&\"-\"&$DI$1&\"-\"&$DA$1,PLAN!D:D))-SUMIF(GELİRLER!$H:$H,\"D\"&CY9&\"-\"&$DA$2&\"-\"&$DI$1&\"-\"&$DA$1,GELİRLER!$G:$G)","v":100},{"$f":"IF(DN9>0,SUMIF(PLAN!$P:$P,\"D\"&CY9&\"-\"&$DI$1&\"-\"&$DA$1,PLAN!E:E),SUMIF(PLAN!$P:$P,\"D\"&\"-\"&$DI$1&\"-\"&$DA$1,PLAN!E:E))-SUMIF(GELİRLER!$H:$H,\"D\"&CY9&\"-\"&$DB$2&\"-\"&$DI$1&\"-\"&$DA$1,GELİRLER!$G:$G)","v":20},{"$f":"IF(DN9>0,SUMIF(PLAN!$P:$P,\"D\"&CY9&\"-\"&$DI$1&\"-\"&$DA$1,PLAN!F:F),SUMIF(PLAN!$P:$P,\"D\"&\"-\"&$DI$1&\"-\"&$DA$1,PLAN!F:F))-SUMIF(GELİRLER!$H:$H,\"D\"&CY9&\"-\"&$DC$2&\"-\"&$DI$1&\"-\"&$DA$1,GELİRLER!$G:$G)","v":45},{"$f":"IF(DN9>0,SUMIF(PLAN!$P:$P,\"D\"&CY9&\"-\"&$DI$1&\"-\"&$DA$1,PLAN!G:G),SUMIF(PLAN!$P:$P,\"D\"&\"-\"&$DI$1&\"-\"&$DA$1,PLAN!G:G))-SUMIF(GELİRLER!$H:$H,\"D\"&CY9&\"-\"&$DD$2&\"-\"&$DI$1&\"-\"&$DA$1,GELİRLER!$G:$G)","v":0},{"$f":"IF(DN9>0,SUMIF(PLAN!$P:$P,\"D\"&CY9&\"-\"&$DI$1&\"-\"&$DA$1,PLAN!H:H),SUMIF(PLAN!$P:$P,\"D\"&\"-\"&$DI$1&\"-\"&$DA$1,PLAN!H:H))-SUMIF(GELİRLER!$H:$H,\"D\"&CY9&\"-\"&$DE$2&\"-\"&$DI$1&\"-\"&$DA$1,GELİRLER!$G:$G)","v":0},{"$f":"IF(DN9>0,SUMIF(PLAN!$P:$P,\"D\"&CY9&\"-\"&$DI$1&\"-\"&$DA$1,PLAN!I:I),SUMIF(PLAN!$P:$P,\"D\"&\"-\"&$DI$1&\"-\"&$DA$1,PLAN!I:I))-SUMIF(GELİRLER!$H:$H,\"D\"&CY9&\"-\"&$DF$2&\"-\"&$DI$1&\"-\"&$DA$1,GELİRLER!$G:$G)","v":0},{"$f":"IF(DN9>0,SUMIF(PLAN!$P:$P,\"D\"&CY9&\"-\"&$DI$1&\"-\"&$DA$1,PLAN!J:J),SUMIF(PLAN!$P:$P,\"D\"&\"-\"&$DI$1&\"-\"&$DA$1,PLAN!J:J))-SUMIF(GELİRLER!$H:$H,\"D\"&CY9&\"-\"&$DG$2&\"-\"&$DI$1&\"-\"&$DA$1,GELİRLER!$G:$G)","v":0},{"$f":"IF(DN9>0,SUMIF(PLAN!$P:$P,\"D\"&CY9&\"-\"&$DI$1&\"-\"&$DA$1,PLAN!K:K),SUMIF(PLAN!$P:$P,\"D\"&\"-\"&$DI$1&\"-\"&$DA$1,PLAN!K:K))-SUMIF(GELİRLER!$H:$H,\"D\"&CY9&\"-\"&$DH$2&\"-\"&$DI$1&\"-\"&$DA$1,GELİRLER!$G:$G)","v":0},{"$f":"IF(DN9>0,SUMIF(PLAN!$P:$P,\"D\"&CY9&\"-\"&$DI$1&\"-\"&$DA$1,PLAN!L:L),SUMIF(PLAN!$P:$P,\"D\"&\"-\"&$DI$1&\"-\"&$DA$1,PLAN!L:L))-SUMIF(GELİRLER!$H:$H,\"D\"&CY9&\"-\"&$DI$2&\"-\"&$DI$1&\"-\"&$DA$1,GELİRLER!$G:$G)","v":0},{"$f":"IF(DN9>0,SUMIF(PLAN!$P:$P,\"D\"&CY9&\"-\"&$DI$1&\"-\"&$DA$1,PLAN!M:M),SUMIF(PLAN!$P:$P,\"D\"&\"-\"&$DI$1&\"-\"&$DA$1,PLAN!M:M))-SUMIF(GELİRLER!$H:$H,\"D\"&CY9&\"-\"&$DJ$2&\"-\"&$DI$1&\"-\"&$DA$1,GELİRLER!$G:$G)","v":0},{"$f":"IF(DN9>0,SUMIF(PLAN!$P:$P,\"D\"&CY9&\"-\"&$DI$1&\"-\"&$DA$1,PLAN!N:N),SUMIF(PLAN!$P:$P,\"D\"&\"-\"&$DI$1&\"-\"&$DA$1,PLAN!N:N))-SUMIF(GELİRLER!$H:$H,\"D\"&CY9&\"-\"&$DK$2&\"-\"&$DI$1&\"-\"&$DA$1,GELİRLER!$G:$G)","v":0},{"$f":"IF(DN9>0,SUMIF(PLAN!$P:$P,\"D\"&CY9&\"-\"&$DI$1&\"-\"&$DA$1,PLAN!O:O),SUMIF(PLAN!$P:$P,\"D\"&\"-\"&$DI$1&\"-\"&$DA$1,PLAN!O:O))-SUMIF(GELİRLER!$H:$H,\"D\"&CY9&\"-\"&$DL$2&\"-\"&$DI$1&\"-\"&$DA$1,GELİRLER!$G:$G)","v":0},"D7-2016-Aidat",{"$f":"COUNTIF(PLAN!P:P,DM9)","v":0},{"$f":"COUNTIF(PLAN!P:P,\"D\"&CY9&\"-\"&$DI$1&\"-YAKIT\")","v":0},{"$f":"ROUND(SUMIF(YAKIT!$J:$J,\"D\"&CY9&\"-\"&$DA$2&\"-\"&$DI$1&\"-\"&\"YAKIT\",YAKIT!$I:$I)+IF(DO9>0,SUMIF(PLAN!$P:$P,\"D\"&CY9&\"-\"&$DI$1&\"-\"&\"YAKIT\",PLAN!D:D),SUMIF(PLAN!$P:$P,\"D\"&\"-\"&$DI$1&\"-\"&\"YAKIT\",PLAN!D:D))-SUMIF(GELİRLER!$H:$H,\"D\"&CY9&\"-\"&$DA$2&\"-\"&$DI$1&\"-\"&\"YAKIT\",GELİRLER!$G:$G),2)","v":0},{"$f":"ROUND(SUMIF(YAKIT!$J:$J,\"D\"&CY9&\"-\"&$DB$2&\"-\"&$DI$1&\"-\"&\"YAKIT\",YAKIT!$I:$I)+IF(DO9>0,SUMIF(PLAN!$P:$P,\"D\"&CY9&\"-\"&$DI$1&\"-\"&\"YAKIT\",PLAN!E:E),SUMIF(PLAN!$P:$P,\"D\"&\"-\"&$DI$1&\"-\"&\"YAKIT\",PLAN!E:E))-SUMIF(GELİRLER!$H:$H,\"D\"&CY9&\"-\"&$DB$2&\"-\"&$DI$1&\"-\"&\"YAKIT\",GELİRLER!$G:$G),2)","v":0},{"$f":"ROUND(SUMIF(YAKIT!$J:$J,\"D\"&CY9&\"-\"&$DC$2&\"-\"&$DI$1&\"-\"&\"YAKIT\",YAKIT!$I:$I)+IF(DO9>0,SUMIF(PLAN!$P:$P,\"D\"&CY9&\"-\"&$DI$1&\"-\"&\"YAKIT\",PLAN!F:F),SUMIF(PLAN!$P:$P,\"D\"&\"-\"&$DI$1&\"-\"&\"YAKIT\",PLAN!F:F))-SUMIF(GELİRLER!$H:$H,\"D\"&CY9&\"-\"&$DC$2&\"-\"&$DI$1&\"-\"&\"YAKIT\",GELİRLER!$G:$G),2)","v":0},{"$f":"ROUND(SUMIF(YAKIT!$J:$J,\"D\"&CY9&\"-\"&$DD$2&\"-\"&$DI$1&\"-\"&\"YAKIT\",YAKIT!$I:$I)+IF(DO9>0,SUMIF(PLAN!$P:$P,\"D\"&CY9&\"-\"&$DI$1&\"-\"&\"YAKIT\",PLAN!G:G),SUMIF(PLAN!$P:$P,\"D\"&\"-\"&$DI$1&\"-\"&\"YAKIT\",PLAN!G:G))-SUMIF(GELİRLER!$H:$H,\"D\"&CY9&\"-\"&$DD$2&\"-\"&$DI$1&\"-\"&\"YAKIT\",GELİRLER!$G:$G),2)","v":0},{"$f":"ROUND(SUMIF(YAKIT!$J:$J,\"D\"&CY9&\"-\"&$DE$2&\"-\"&$DI$1&\"-\"&\"YAKIT\",YAKIT!$I:$I)+IF(DO9>0,SUMIF(PLAN!$P:$P,\"D\"&CY9&\"-\"&$DI$1&\"-\"&\"YAKIT\",PLAN!H:H),SUMIF(PLAN!$P:$P,\"D\"&\"-\"&$DI$1&\"-\"&\"YAKIT\",PLAN!H:H))-SUMIF(GELİRLER!$H:$H,\"D\"&CY9&\"-\"&$DE$2&\"-\"&$DI$1&\"-\"&\"YAKIT\",GELİRLER!$G:$G),2)","v":0},{"$f":"ROUND(SUMIF(YAKIT!$J:$J,\"D\"&CY9&\"-\"&$DF$2&\"-\"&$DI$1&\"-\"&\"YAKIT\",YAKIT!$I:$I)+IF(DO9>0,SUMIF(PLAN!$P:$P,\"D\"&CY9&\"-\"&$DI$1&\"-\"&\"YAKIT\",PLAN!I:I),SUMIF(PLAN!$P:$P,\"D\"&\"-\"&$DI$1&\"-\"&\"YAKIT\",PLAN!I:I))-SUMIF(GELİRLER!$H:$H,\"D\"&CY9&\"-\"&$DF$2&\"-\"&$DI$1&\"-\"&\"YAKIT\",GELİRLER!$G:$G),2)","v":0},{"$f":"ROUND(SUMIF(YAKIT!$J:$J,\"D\"&CY9&\"-\"&$DG$2&\"-\"&$DI$1&\"-\"&\"YAKIT\",YAKIT!$I:$I)+IF(DO9>0,SUMIF(PLAN!$P:$P,\"D\"&CY9&\"-\"&$DI$1&\"-\"&\"YAKIT\",PLAN!J:J),SUMIF(PLAN!$P:$P,\"D\"&\"-\"&$DI$1&\"-\"&\"YAKIT\",PLAN!J:J))-SUMIF(GELİRLER!$H:$H,\"D\"&CY9&\"-\"&$DG$2&\"-\"&$DI$1&\"-\"&\"YAKIT\",GELİRLER!$G:$G),2)","v":0},{"$f":"ROUND(SUMIF(YAKIT!$J:$J,\"D\"&CY9&\"-\"&$DH$2&\"-\"&$DI$1&\"-\"&\"YAKIT\",YAKIT!$I:$I)+IF(DO9>0,SUMIF(PLAN!$P:$P,\"D\"&CY9&\"-\"&$DI$1&\"-\"&\"YAKIT\",PLAN!K:K),SUMIF(PLAN!$P:$P,\"D\"&\"-\"&$DI$1&\"-\"&\"YAKIT\",PLAN!K:K))-SUMIF(GELİRLER!$H:$H,\"D\"&CY9&\"-\"&$DH$2&\"-\"&$DI$1&\"-\"&\"YAKIT\",GELİRLER!$G:$G),2)","v":0},{"$f":"ROUND(SUMIF(YAKIT!$J:$J,\"D\"&CY9&\"-\"&$DI$2&\"-\"&$DI$1&\"-\"&\"YAKIT\",YAKIT!$I:$I)+IF(DO9>0,SUMIF(PLAN!$P:$P,\"D\"&CY9&\"-\"&$DI$1&\"-\"&\"YAKIT\",PLAN!L:L),SUMIF(PLAN!$P:$P,\"D\"&\"-\"&$DI$1&\"-\"&\"YAKIT\",PLAN!L:L))-SUMIF(GELİRLER!$H:$H,\"D\"&CY9&\"-\"&$DI$2&\"-\"&$DI$1&\"-\"&\"YAKIT\",GELİRLER!$G:$G),2)","v":0},{"$f":"ROUND(SUMIF(YAKIT!$J:$J,\"D\"&CY9&\"-\"&$DJ$2&\"-\"&$DI$1&\"-\"&\"YAKIT\",YAKIT!$I:$I)+IF(DO9>0,SUMIF(PLAN!$P:$P,\"D\"&CY9&\"-\"&$DI$1&\"-\"&\"YAKIT\",PLAN!M:M),SUMIF(PLAN!$P:$P,\"D\"&\"-\"&$DI$1&\"-\"&\"YAKIT\",PLAN!M:M))-SUMIF(GELİRLER!$H:$H,\"D\"&CY9&\"-\"&$DJ$2&\"-\"&$DI$1&\"-\"&\"YAKIT\",GELİRLER!$G:$G),2)","v":0},{"$f":"ROUND(SUMIF(YAKIT!$J:$J,\"D\"&CY9&\"-\"&$DK$2&\"-\"&$DI$1&\"-\"&\"YAKIT\",YAKIT!$I:$I)+IF(DO9>0,SUMIF(PLAN!$P:$P,\"D\"&CY9&\"-\"&$DI$1&\"-\"&\"YAKIT\",PLAN!N:N),SUMIF(PLAN!$P:$P,\"D\"&\"-\"&$DI$1&\"-\"&\"YAKIT\",PLAN!N:N))-SUMIF(GELİRLER!$H:$H,\"D\"&CY9&\"-\"&$DK$2&\"-\"&$DI$1&\"-\"&\"YAKIT\",GELİRLER!$G:$G),2)","v":0},{"$f":"ROUND(SUMIF(YAKIT!$J:$J,\"D\"&CY9&\"-\"&$DL$2&\"-\"&$DI$1&\"-\"&\"YAKIT\",YAKIT!$I:$I)+IF(DO9>0,SUMIF(PLAN!$P:$P,\"D\"&CY9&\"-\"&$DI$1&\"-\"&\"YAKIT\",PLAN!O:O),SUMIF(PLAN!$P:$P,\"D\"&\"-\"&$DI$1&\"-\"&\"YAKIT\",PLAN!O:O))-SUMIF(GELİRLER!$H:$H,\"D\"&CY9&\"-\"&$DL$2&\"-\"&$DI$1&\"-\"&\"YAKIT\",GELİRLER!$G:$G),2)","v":0}]
["KİRA",{"$f":"+Z3","v":0},{"$f":"+AA3","v":0},0,0,0,0,0,0,0,0,0,0,"KALAN",{"$f":"+O8-O9","v":100},20,45,0,0,0,0,{"$f":"+V8-V9","v":0},{"$f":"+W8-W9","v":0},{"$f":"+X8-X9","v":0},{"$f":"+Y8-Y9","v":0},{"$f":"+Z8-Z9","v":0}]
["TAHSİLAT",0,0,0,0,0,0,0,0,0,0,0,0]
["KALAN",0,0,0,0,0,0,0,0,0,0,0,0]
[null,null,null,null,null,null,null,null,null,null,null,null,null,null,null,null,null,null,null,null,null,null,null,null,null,null,null,null,null,null,null,null,null,null,null,null,null,null,null,null,null,null,null,null,null,null,null,null,null,null,null,null,null,null,null,null,null,null,null,null,null,null,null,null,null,null,null,null,null,null,null,{"$f":"IF($BT$6=$B$1,B8,IF($BT$6=$C$1,C8,IF($BT$6=$D$1,D8,IF($BT$6=$E$1,E8,IF($BT$6=$F$1,F8,IF($BT$6=$G$1,G8,BU13))))))","v":0},{"$f":"IF($BT$6=$H$1,H8,IF($BT$6=$I$1,I8,IF($BT$6=$J$1,J8,IF($BT$6=$K$1,K8,IF($BT$6=$L$1,L8,IF($BT$6=$M$1,M8,\"\"))))))","v":""}]
["DİĞER",{"$f":"+AL3","v":0},{"$f":"+AM3","v":0},0,0,0,0,0,0,0,0,0,0]
["TAHSİLAT",0,0,0,0,0,0,0,0,0,0,0,0]
["KALAN",0,0,{"$f":"+AN5","v":0},0,0,0,0,0,0,0,0,0]
[null,null,null,null,null,null,null,null,null,null,null,null,null,null,null,null,null,null,null,null,null,null,null,null,null,null,null,null,null,null,null,null,null,null,null,null,null,null,null,null,null,null,null,null,null,null,null,null,null,null,null,null,null,null,null,null,null,null,null,null,null,null,null,null,null,null,null,null,null,null,null,{"$f":"IF($BT$6=$B$1,B12,IF($BT$6=$C$1,C12,IF($BT$6=$D$1,D12,IF($BT$6=$E$1,E12,IF($BT$6=$F$1,F12,IF($BT$6=$G$1,G12,BU17))))))","v":0},{"$f":"IF($BT$6=$H$1,H12,IF($BT$6=$I$1,I12,IF($BT$6=$J$1,J12,IF($BT$6=$K$1,K12,IF($BT$6=$L$1,L12,IF($BT$6=$M$1,M12,\"\"))))))","v":""}]
["YAKIT",{"$f":"+AX3","v":0},0,0,0,0,0,0,0,0,0,0,0]
["TAHSİLAT",0,0,0,0,0,0,0,0,0,0,0,0]
["KALAN",0,0,0,0,0,0,0,0,0,0,0,0]
[null,null,null,null,null,null,null,null,null,null,null,null,null,null,null,null,null,null,null,null,null,null,null,null,null,null,null,null,null,null,null,null,null,null,null,null,null,null,null,null,null,null,null,null,null,null,null,null,null,null,null,null,null,null,null,null,null,null,null,null,null,null,null,null,null,null,null,null,null,null,null,{"$f":"IF($BT$6=$B$1,B16,IF($BT$6=$C$1,C16,IF($BT$6=$D$1,D16,IF($BT$6=$E$1,E16,IF($BT$6=$F$1,F16,IF($BT$6=$G$1,G16,BU21))))))","v":0},{"$f":"IF($BT$6=$H$1,H16,IF($BT$6=$I$1,I16,IF($BT$6=$J$1,J16,IF($BT$6=$K$1,K16,IF($BT$6=$L$1,L16,IF($BT$6=$M$1,M16,\"\"))))))","v":""}]
["AY AY BORÇ",{"$f":"+B4+B8+B12+B16+B20","v":100},{"$f":"+C4+C8+C12+C16+C20","v":20},45,0,0,0,0,0,0,0,0,0]
[{"$f":"V1& \" YILI TOPLAM BORÇ\"","v":"2016 YILI TOPLAM BORÇ"},{"$f":"ROUND(SUM(B22:M22),2)","v":165}]
["TÜM BORÇ TOPLAMI",{"$f":"SUM(PLAN!D:O)-SUMIF(GELİRLER!B:G,W1,GELİRLER!G:G)","v":240}]
[null,null,null,null,null,null,null,null,null,null,null,null,null,null,null,null,null,null,null,null,null,null,null,null,null,null,null,null,null,null,null,null,null,null,null,null,null,null,null,null,null,null,null,null,null,null,null,null,null,null,null,null,null,null,null,null,null,null,null,null,null,null,null,null,null,null,null,null,null,null,null,{"$f":"IF($BT$6=$B$1,B20,IF($BT$6=$C$1,C20,IF($BT$6=$D$1,D20,IF($BT$6=$E$1,E20,IF($BT$6=$F$1,F20,IF($BT$6=$G$1,G20,BU25))))))","v":0},{"$f":"IF($BT$6=$H$1,H20,IF($BT$6=$I$1,I20,IF($BT$6=$J$1,J20,IF($BT$6=$K$1,K20,IF($BT$6=$L$1,L20,IF($BT$6=$M$1,M20,\"\"))))))","v":""}]
[]
[]
[]
[]
[]
[]
[]
[]
[]
[]
[]
["Aidat",null,"Ocak","Mülk Sahibi"]
["Bakım-Onarım (Demirbaş)",null,"Şubat","Kiracı"]
["Kira",null,"Mart","Diğer"]
["Diğer Tahsilat",null,"Nisan"]
["Yakıt",null,"Mayıs","Evet"]
[null,null,"Haziran","Hayır"]
["PAY ÖLÇERLİ (M2'YE GÖRE)",null,"Temmuz"]
["PAY ÖLÇERLİ (GENEL)",null,"Ağustos","Kendisi"]
["EŞİT DAĞITIM",null,"Eylül","Eşi"]
["BANKA HESABINDAN",{"$f":"(BANKA!F2)","v":2.5},"Ekim","Oğlu"]
["KASADAN (NAKİT)",{"$f":"SUM(GELİRLER!G:G)-SUM(GİDER!G:G)-B46","v":2.9399999999999977},"Kasım","Kızı"]
["MASRAF - GİDER",null,"Aralık","Annesi"]
["MENKUL (DEMİRBAŞ)",null,"Yatan","Babası"]
["GENEL",null,"Çekilen","Kardeşi"]
["ÖZEL",null,null,"Diğer"]
["CİNSİ",{"$f":"COUNTA(MENKUL!A:A)-1","v":1},"Öder"]
["ADEDİ",{"$f":"SUM(MENKUL!G:G)","v":1},"Ödemez"]
["APT.SİTEDE YAŞAYANLAR",{"$f":"SUM(ÜYE!D:D)","v":5}]
["YAŞAYAN GİRİŞ",{"$f":"COUNTA(HANE!B:B)-1","v":0}]
["Aidat"]
["Demirbaş"]
["Kira"]
["Diğer"]
["Yakıt"]

{"sheet":"ÜYE","index":1,"n_rows":8,"n_cols":28,"rows_kept":8,"cut":false,"hidden":false,"merged":[]}
["DAİRE NO","ADI SOYADI","DAİRE M2","HANE HALKI","MÜLKİYET DURUMU","TELEFON",null,null,null,null,null,null,null,null,null,null,null,null,null,null,null,null,null,{"$f":"IF(Y1=Z1,\"Bu Üyenin Girişi Yapılmıştır.\",\"\")","v":""},{"$f":"COUNTIF(A:A,Z1)","v":0},8,{"$f":"COUNTA(A2:A1200)","v":7},{"$f":"AD1&\"$a$1:$c$\"&AA1+1&AD1","v":"$a$1:$c$8"}]
[1,"Tahir",120,2,"Mülk Sahibi",5383483624]
[2,"Arslan",150,3,"Kiracı",5383483624]
[3,"Dilek"]
[4,"Kırıkçı",4]
[5,"Semra"]
[6,"Yağız"]
[7,"İlyas"]

{"sheet":"YAKIT","index":2,"n_rows":8,"n_cols":15,"rows_kept":8,"cut":false,"hidden":false,"merged":[]}
["DAİRE NO","İLK ENDEKS","SON ENDEKS","FARK ENDEKS","DAİRE M2","ORTAK ALAN PAYI","DAİRE TÜKETİMİ","ORTAK ALAN TÜKETİMİ","TOPLAM","D-Ocak-2016-YAKIT","Ocak-2016",{"$f":"SUMIF(A2:C65520,K1,C2:C65520)-SUMIF(A2:B65520,K1,B2:B65520)","v":0},{"$f":"SUMIF(ÜYE!A:C,K1,ÜYE!C:C)","v":0},{"$f":"VLOOKUP(K1,ÜYE!A:C,2,FALSE)","v":{"$error":"#N/A"}},{"$f":"COUNTIF(K2:K1595,J1)","v":0}]
[null,null,null,null,null,null,null,null,null,"D1-Şubat-2016-YAKIT","Şubat-2016"]
[null,null,null,null,null,null,null,null,null,"D2-Şubat-2016-YAKIT","Şubat-2016"]
[null,null,null,null,null,null,null,null,null,"D1-Ocak-2016-YAKIT","Ocak-2016"]
[null,null,null,null,null,null,null,null,null,"D2-Ocak-2016-YAKIT","Ocak-2016"]
[null,null,null,null,null,null,null,null,null,"Ocak-2016","Mart-2016"]
[null,null,null,null,null,null,null,null,null,"D2-Mart-2016-YAKIT","Mart-2016"]
[null,null,null,null,null,null,null,null,null,"D1-Mart-2016-YAKIT","Mart-2016"]

{"sheet":"PLAN","index":3,"n_rows":1992,"n_cols":69,"rows_kept":1992,"cut":false,"hidden":false,"merged":[]}
["ÖZEL ÜYE","YIL","TÜR","OCAK","ŞUBAT","MART","NİSAN","MAYIS","HAZİRAN","TEMMUZ","AĞUSTOS","EYLÜL","EKİM","KASIM","ARALIK","ANAHTAR","AÇIKLAMA",null,null,null,null,null,null,null,null,null,"D-2016-Aidat",{"$f":"COUNTIF(P:P,AA1)","v":3},null,null,null,null,null,null,null,null,null,null,null,null,null,null,null,null,null,null,null,null,null,null,null,null,"ÖZEL ÜYE","YIL","TÜR","OCAK","ŞUBAT","MART","NİSAN","MAYIS","HAZİRAN","TEMMUZ","AĞUSTOS","EYLÜL","EKİM","KASIM","ARALIK","ANAHTAR","AÇIKLAMA"]
[null,2016,"Aidat",100,0,0,0,0,0,0,0,0,0,0,0,"D-2016-Aidat","Ghfhgfj",null,null,null,null,null,null,null,null,null,null,null,null,null,null,null,null,null,null,null,null,null,null,null,null,null,null,null,null,null,null,null,null,null,null,null,null,2016,"Aidat",100,0,0,0,0,0,0,0,0,0,0,0,"D-2016-Aidat","Ghfhgfj"]
[1,2016,"Aidat",0,50,0,0,0,0,0,0,0,0,0,0,"D1-2016-Aidat","Ghfhgfj",null,null,null,null,null,null,null,null,null,null,null,null,null,null,null,null,null,null,null,null,null,null,null,null,null,null,null,null,null,null,null,null,null,null,null,1,2016,"Aidat",0,50,0,0,0,0,0,0,0,0,0,0,"D1-2016-Aidat","Ghfhgfj"]
[1,2016,"Aidat",0,25,0,0,0,0,0,0,0,0,0,0,"D1-2016-Aidat","Jhfkgfgh",null,null,null,null,null,null,null,null,null,null,null,null,null,null,null,null,null,null,null,null,null,null,null,null,null,null,null,null,null,null,null,null,null,null,null,1,2016,"Aidat",0,25,0,0,0,0,0,0,0,0,0,0,"D1-2016-Aidat","Jhfkgfgh"]
[null,2016,"Aidat",0,20,0,0,0,0,0,0,0,0,0,0,"D-2016-Aidat","Hgjhghjg",null,null,null,null,null,null,null,null,null,null,null,null,null,null,null,null,null,null,null,null,null,null,null,null,null,null,null,null,null,null,null,null,null,null,null,null,2016,"Aidat",0,20,0,0,0,0,0,0,0,0,0,0,"D-2016-Aidat","Hgjhghjg"]
[null,2016,"Aidat",0,0,45,0,0,0,0,0,0,0,0,0,"D-2016-Aidat","Gfdhgdjhd"]
[]
[]
[]
[]
[]
[]
[]
[]
[]
[]
[]
[]
[]
[]
[]
[]
[]
[]
[]
[]
[]
[]
[]
[]
[]
[]
[]
[]
[]
[]
[]
[]
[]
[]
[]
[]
[]
[]
[]
[]
[]
[]
[]
[]
[]
[]
[]
[]
[]
[]
[]
[]
[]
[]
[]
[]
[]
[]
[]
[]
[]
[]
[]
[]
[]
[]
[]
[]
[]
[]
[]
[]
[]
[]
[]
[]
[]
[]
[]
[]
[]
[]
[]
[]
[]
[]
[]
[]
[]
[]
[]
[]
[]
[]
[]
[]
[]
[]
[]
[]
[]
[]
[]
[]
[]
[]
[]
[]
[]
[]
[]
[]
[]
[]
[]
[]
[]
[]
[]
[]
[]
[]
[]
[]
[]
[]
[]
[]
[]
[]
[]
[]
[]
[]
[]
[]
[]
[]
[]
[]
[]
[]
[]
[]
[]
[]
[]
[]
[]
[]
[]
[]
[]
[]
[]
[]
[]
[]
[]
[]
[]
[]
[]
[]
[]
[]
[]
[]
[]
[]
[]
[]
[]
[]
[]
[]
[]
[]
[]
[]
[]
[]
[]
[]
[]
[]
[]
[]
[]
[]
[]
[]
[]
[]
[]
[]
[]
[]
[]
[]
[]
[]
[]
[]
[]
[]
[]
[]
[]
[]
[]
[]
[]
[]
[]
[]
[]
[]
[]
[]
[]
[]
[]
[]
[]
[]
[]
[]
[]
[]
[]
[]
[]
[]
[]
[]
[]
[]
[]
[]
[]
[]
[]
[]
[]
[]
[]
[]
[]
[]
[]
[]
[]
[]
[]
[]
[]
[]
[]
[]
[]
[]
[]
[]
[]
[]
[]
[]
[]
[]
[]
[]
[]
[]
[]
[]
[]
[]
[]
[]
[]
[]
[]
[]
[]
[]
[]
[]
[]
[]
[]
[]
[]
[]
[]
[]
[]
[]
[]
[]
[]
[]
[]
[]
[]
[]
[]
[]
[]
[]
[]
[]
[]
[]
[]
[]
[]
[]
[]
[]
[]
[]
[]
[]
[]
[]
[]
[]
[]
[]
[]
[]
[]
[]
[]
[]
[]
[]
[]
[]
[]
[]
[]
[]
[]
[]
[]
[]
[]
[]
[]
[]
[]
[]
[]
[]
[]
[]
[]
[]
[]
[]
[]
[]
[]
[]
[]
[]
[]
[]
[]
[]
[]
[]
[]
[]
[]
[]
[]
[]
[]
[]
[]
[]
[]
[]
[]
[]
[]
[]
[]
[]
[]
[]
[]
[]
[]
[]
[]
[]
[]
[]
[]
[]
[]
[]
[]
[]
[]
[]
[]
[]
[]
[]
[]
[]
[]
[]
[]
[]
[]
[]
[]
[]
[]
[]
[]
[]
[]
[]
[]
[]
[]
[]
[]
[]
[]
[]
[]
[]
[]
[]
[]
[]
[]
[]
[]
[]
[]
[]
[]
[]
[]
[]
[]
[]
[]
[]
[]
[]
[]
[]
[]
[]
[]
[]
[]
[]
[]
[]
[]
[]
[]
[]
[]
[]
[]
[]
[]
[]
[]
[]
[]
[]
[]
[]
[]
[]
[]
[]
[]
[]
[]
[]
[]
[]
[]
[]
[]
[]
[]
[]
[]
[]
[]
[]
[]
[]
[]
[]
[]
[]
[]
[]
[]
[]
[]
[]
[]
[]
[]
[]
[]
[]
[]
[]
[]
[]
[]
[]
[]
[]
[]
[]
[]
[]
[]
[]
[]
[]
[]
[]
[]
[]
[]
[]
[]
[]
[]
[]
[]
[]
[]
[]
[]
[]
[]
[]
[]
[]
[]
[]
[]
[]
[]
[]
[]
[]
[]
[]
[]
[]
[]
[]
[]
[]
[]
[]
[]
[]
[]
[]
[]
[]
[]
[]
[]
[]
[]
[]
[]
[]
[]
[]
[]
[]
[]
[]
[]
[]
[]
[]
[]
[]
[]
[]
[]
[]
[]
[]
[]
[]
[]
[]
[]
[]
[]
[]
[]
[]
[]
[]
[]
[]
[]
[]
[]
[]
[]
[]
[]
[]
[]
[]
[]
[]
[]
[]
[]
[]
[]
[]
[]
[]
[]
[]
[]
[]
[]
[]
[]
[]
[]
[]
[]
[]
[]
[]
[]
[]
[]
[]
[]
[]
[]
[]
[]
[]
[]
[]
[]
[]
[]
[]
[]
[]
[]
[]
[]
[]
[]
[]
[]
[]
[]
[]
[]
[]
[]
[]
[]
[]
[]
[]
[]
[]
[]
[]
[]
[]
[]
[]
[]
[]
[]
[]
[]
[]
[]
[]
[]
[]
[]
[]
[]
[]
[]
[]
[]
[]
[]
[]
[]
[]
[]
[]
[]
[]
[]
[]
[]
[]
[]
[]
[]
[]
[]
[]
[]
[]
[]
[]
[]
[]
[]
[]
[]
[]
[]
[]
[]
[]
[]
[]
[]
[]
[]
[]
[]
[]
[]
[]
[]
[]
[]
[]
[]
[]
[]
[]
[]
[]
[]
[]
[]
[]
[]
[]
[]
[]
[]
[]
[]
[]
[]
[]
[]
[]
[]
[]
[]
[]
[]
[]
[]
[]
[]
[]
[]
[]
[]
[]
[]
[]
[]
[]
[]
[]
[]
[]
[]
[]
[]
[]
[]
[]
[]
[]
[]
[]
[]
[]
[]
[]
[]
[]
[]
[]
[]
[]
[]
[]
[]
[]
[]
[]
[]
[]
[]
[]
[]
[]
[]
[]
[]
[]
[]
[]
[]
[]
[]
[]
[]
[]
[]
[]
[]
[]
[]
[]
[]
[]
[]
[]
[]
[]
[]
[]
[]
[]
[]
[]
[]
[]
[]
[]
[]
[]
[]
[]
[]
[]
[]
[]
[]
[]
[]
[]
[]
[]
[]
[]
[]
[]
[]
[]
[]
[]
[]
[]
[]
[]
[]
[]
[]
[]
[]
[]
[]
[]
[]
[]
[]
[]
[]
[]
[]
[]
[]
[]
[]
[]
[]
[]
[]
[]
[]
[]
[]
[]
[]
[]
[]
[]
[]
[]
[]
[]
[]
[]
[]
[]
[]
[]
[]
[]
[]
[]
[]
[]
[]
[]
[]
[]
[]
[]
[]
[]
[]
[]
[]
[]
[]
[]
[]
[]
[]
[]
[]
[]
[]
[]
[]
[]
[]
[]
[]
[]
[]
[]
[]
[]
[]
[]
[]
[]
[]
[]
[]
[]
[]
[]
[]
[]
[]
[]
[]
[]
[]
[]
[]
[]
[]
[]
[]
[]
[]
[]
[]
[]
[]
[]
[]
[]
[]
[]
[]
[]
[]
[]
[]
[]
[]
[]
[]
[]
[]
[]
[]
[]
[]
[]
[]
[]
[]
[]
[]
[]
[]
[]
[]
[]
[]
[]
[]
[]
[]
[]
[]
[]
[]
[]
[]
[]
[]
[]
[]
[]
[]
[]
[]
[]
[]
[]
[]
[]
[]
[]
[]
[]
[]
[]
[]
[]
[]
[]
[]
[]
[]
[]
[]
[]
[]
[]
[]
[]
[]
[]
[]
[]
[]
[]
[]
[]
[]
[]
[]
[]
[]
[]
[]
[]
[]
[]
[]
[]
[]
[]
[]
[]
[]
[]
[]
[]
[]
[]
[]
[]
[]
[]
[]
[]
[]
[]
[]
[]
[]
[]
[]
[]
[]
[]
[]
[]
[]
[]
[]
[]
[]
[]
[]
[]
[]
[]
[]
[]
[]
[]
[]
[]
[]
[]
[]
[]
[]
[]
[]
[]
[]
[]
[]
[]
[]
[]
[]
[]
[]
[]
[]
[]
[]
[]
[]
[]
[]
[]
[]
[]
[]
[]
[]
[]
[]
[]
[]
[]
[]
[]
[]
[]
[]
[]
[]
[]
[]
[]
[]
[]
[]
[]
[]
[]
[]
[]
[]
[]
[]
[]
[]
[]
[]
[]
[]
[]
[]
[]
[]
[]
[]
[]
[]
[]
[]
[]
[]
[]
[]
[]
[]
[]
[]
[]
[]
[]
[]
[]
[]
[]
[]
[]
[]
[]
[]
[]
[]
[]
[]
[]
[]
[]
[]
[]
[]
[]
[]
[]
[]
[]
[]
[]
[]
[]
[]
[]
[]
[]
[]
[]
[]
[]
[]
[]
[]
[]
[]
[]
[]
[]
[]
[]
[]
[]
[]
[]
[]
[]
[]
[]
[]
[]
[]
[]
[]
[]
[]
[]
[]
[]
[]
[]
[]
[]
[]
[]
[]
[]
[]
[]
[]
[]
[]
[]
[]
[]
[]
[]
[]
[]
[]
[]
[]
[]
[]
[]
[]
[]
[]
[]
[]
[]
[]
[]
[]
[]
[]
[]
[]
[]
[]
[]
[]
[]
[]
[]
[]
[]
[]
[]
[]
[]
[]
[]
[]
[]
[]
[]
[]
[]
[]
[]
[]
[]
[]
[]
[]
[]
[]
[]
[]
[]
[]
[]
[]
[]
[]
[]
[]
[]
[]
[]
[]
[]
[]
[]
[]
[]
[]
[]
[]
[]
[]
[]
[]
[]
[]
[]
[]
[]
[]
[]
[]
[]
[]
[]
[]
[]
[]
[]
[]
[]
[]
[]
[]
[]
[]
[]
[]
[]
[]
[]
[]
[]
[]
[]
[]
[]
[]
[]
[]
[]
[]
[]
[]
[]
[]
[]
[]
[]
[]
[]
[]
[]
[]
[]
[]
[]
[]
[]
[]
[]
[]
[]
[]
[]
[]
[]
[]
[]
[]
[]
[]
[]
[]
[]
[]
[]
[]
[]
[]
[]
[]
[]
[]
[]
[]
[]
[]
[]
[]
[]
[]
[]
[]
[]
[]
[]
[]
[]
[]
[]
[]
[]
[]
[]
[]
[]
[]
[]
[]
[]
[]
[]
[]
[]
[]
[]
[]
[]
[]
[]
[]
[]
[]
[]
[]
[]
[]
[]
[]
[]
[]
[]
[]
[]
[]
[]
[]
[]
[]
[]
[]
[]
[]
[]
[]
[]
[]
[]
[]
[]
[]
[]
[]
[]
[]
[]
[]
[]
[]
[]
[]
[]
[]
[]
[]
[]
[]
[]
[]
[]
[]
[]
[]
[]
[]
[]
[]
[]
[]
[]
[]
[]
[]
[]
[]
[]
[]
[]
[]
[]
[]
[]
[]
[]
[]
[]
[]
[]
[]
[]
[]
[]
[]
[]
[]
[]
[]
[]
[]
[]
[]
[]
[]
[]
[]
[]
[]
[]
[]
[]
[]
[]
[]
[]
[]
[]
[]
[]
[]
[]
[]
[]
[]
[]
[]
[]
[]
[]
[]
[]
[]
[]
[]
[]
[]
[]
[]
[]
[]
[]
[]
[]
[]
[]
[]
[]
[]
[]
[]
[]
[]
[]
[]
[]
[]
[]
[]
[]
[]
[]
[]
[]
[]
[]
[]
[]
[]
[]
[]
[]
[]
[]
[]
[]
[]
[]
[]
[]
[]
[]
[]
[]
[]
[]
[]
[]
[]
[]
[]
[]
[]
[]
[]
[]
[]
[]
[]
[]
[]
[]
[]
[]
[]
[]
[]
[]
[]
[]
[]
[]
[]
[]
[]
[]
[]
[]
[]
[]
[]
[]
[]
[]
[]
[]
[]
[]
[]
[]
[]
[]
[]
[]
[]
[]
[]
[]
[]
[]
[]
[]
[]
[]
[]
[]
[]
[]
[]
[]
[]
[]
[]
[]
[]
[]
[]
[]
[]
[]
[]
[]
[]
[]
[]
[]
[]
[]
[]
[]
[]
[]
[]
[]
[]
[]
[]
[]
[]
[]
[]
[]
[]
[]
[]
[]
[]
[]
[]
[]
[]
[]
[]
[]
[]
[]
[]
[]
[]
[]
[]
[]
[]
[]
[]
[]
[]
[]
[]
[]
[]
[]
[]
[]
[]
[]
[]
[]
[]
[]
[]
[]
[]
[]
[]
[]
[]
[]
[]
[]
[]
[]
[]
[]
[]
[]
[]
[]
[]
[]
[]
[]
[]
[]
[]
[]
[]
[]
[]
[]
[]
[]
[]
[]
[]
[]
[]
[]
[]
[]
[]
[]
[]
[]
[]
[]
[]
[]
[]
[]
[]
[]
[]
[]
[]
[]
[]
[]
[]
[]
[]
[]
[]
[]
[]
[]
[]
[]
[]
[]
[]
[]
[]
[]
[]
[]
[]
[]
[]
[]
[]
[]
[]
[]
[]
[]
[]
[]
[]
[]
[]
[]
[]
[]
[]
[]
[]
[]
[]
[]
[]
[]
[]
[]
[]
[]
[]
[]
[]
[]
[]
[]
[]
[]
[]
[]
[]
[]
[]
[]
[]
[]
[]
[]
[]
[]
[]
[]
[]
[]
[]
[]
[]
[]
[]
[]
[]
[]
[]
[]
[]
[]
[]
[]
[]
[]
[]
[]
[]
[]
[]
[]
[]
[]
[]
[]
[]
[]
[]
[]
[]
[]
[]
[]
[]
[]
[]
[null,null,null,null,null,null,null,null,null,null,null,null,null,null,null,null,null,null,null,null,null,null,null,null,null,null,null,null,null,null,null,null,null,null,null,null,null,null,null,null,null,null,null,null,null,null,null,null,null,null,null,null,null,null,"aydınlık 6. sokak"]

{"sheet":"GELİRLER","index":4,"n_rows":6,"n_cols":8,"rows_kept":6,"cut":false,"hidden":false,"merged":[]}
["YIL","ÜYE NO","ADI SOYADI","AÇIKLAMA","TARİH","AY / YIL","TUTAR"]
[2016,1,"Tahir","1 Nolu Dairenin Şubat-2016 Ayı için Aidat olarak.","24.04.2016","Şubat-2016",35,"D1-Şubat-2016-Aidat"]
[2016,1,"Tahir","1 Nolu Dairenin Şubat-2016 Ayı için Aidat olarak.","24.04.2016","Şubat-2016",40,"D1-Şubat-2016-Aidat"]
[2016,1,"Tahir","1 Nolu Dairenin Şubat-2016 Ayı Aidat Borcunun Gecikme Faizi","24.04.2016","Şubat-2016",0.44,"Gecikme Faizi"]
[null,null,null,null,null,null,null,"D7-Şubat-2016-Aidat"]
[null,null,null,null,null,null,null,"D7-Mart-2016-Aidat"]

{"sheet":"GİDER","index":5,"n_rows":3,"n_cols":7,"rows_kept":3,"cut":false,"hidden":false,"merged":[]}
["YIL","KİME / NEREYE HARCANDIĞI","TC./VERGİ NO","TARİH","BELGE NO","AÇIKLAMA","HARCAMA TUTARI"]
[2016,"Jkljşlkjlk",null,"25.04.2016",125,"Jkljşlkjlk-Nisan-2016 Ayı- Jhgkhjgkjh",7.5]
[2016,"Kkljkjpoı Iuıouı",null,"25.04.2016",458,"Kkljkjpoı Iuıouı-Nisan-2016 Ayı- Yuıyuı Uyyuıyo",62.5]

{"sheet":"MENKUL","index":6,"n_rows":2,"n_cols":8,"rows_kept":2,"cut":false,"hidden":false,"merged":[]}
["D.B.NO","KİME / NEREYE HARCANDIĞI","TC./VERGİ NO","TARİH","BELGE NO","CİNSİ","ADEDİ","HARCAMA TUTARI"]
[1,"Kkljkjpoı Iuıouı",null,"25.04.2016",458,"Televizyon",1,62.5]

{"sheet":"DEFTER","index":7,"n_rows":42,"n_cols":29,"rows_kept":42,"cut":false,"hidden":false,"merged":[[0,0,0,3],[0,4,0,7],[1,4,2,4],[3,4,5,4],[1,0,2,0],[3,0,5,0]]}
["GELİRLER",null,null,null,"GİDERLER",null,null,null,null,null,null,"Aidat","ÇEKİLEN","YATAN","GİDER","Aidat","ÇEKİLEN","YATAN","GİDER","gelir devir",null,null,2016,"Aidat","ÇEKİLEN","YATAN","GİDER","KASA","BANKA"]
["MADDE ","İŞLEM TARİHİ","AÇIKLAMA","TUTAR","MADDE ","İŞLEM TARİHİ","AÇIKLAMA","TUTAR",null,null,2015,{"$f":"SUMIF(GELİRLER!A:G,K2,GELİRLER!G:G)","v":0},{"$f":"SUMIF(BANKA!A:D,K2,BANKA!D:D)","v":0},{"$f":"SUMIF(BANKA!A:E,K2,BANKA!E:E)","v":0},{"$f":"SUMIF(GİDER!A:G,K2,GİDER!G:G)","v":0},{"$f":"IF(K2<=$W$1,L2,0)","v":0},{"$f":"IF($K$2<=$W$1,M2,0)","v":0},{"$f":"IF(K2<=$W$1,N2,0)","v":0},{"$f":"IF(K2<=$W$1,O2,0)","v":0},{"$f":"-IF(K2<$W$1,L2,0)","v":0},{"$f":"-IF(K2<$W$1,O2,0)","v":0},null,null,{"$f":"SUM(P:P)","v":75.44},{"$f":"SUM(Q:Q)","v":72.94},{"$f":"SUM(R:R)","v":75.44},{"$f":"SUM(S:S)","v":70},{"$f":"+X2+Y2-Z2-AA2","v":2.9399999999999977},{"$f":"+Z2-Y2","v":2.5}]
[null,null,"MALİ İŞLEM YILI GELİRLER TOPLAMI",{"$f":"SUM(D4:D65000)-D6","v":148.38},null,null,"MALİ İŞLEM YILI GİDERLER TOPLAMI",{"$f":"SUM(H4:H65000)","v":148.38},null,null,{"$f":"K2+1","v":2016},{"$f":"SUMIF(GELİRLER!A:G,K3,GELİRLER!G:G)","v":75.44},{"$f":"SUMIF(BANKA!A:D,K3,BANKA!D:D)","v":72.94},{"$f":"SUMIF(BANKA!A:E,K3,BANKA!E:E)","v":75.44},{"$f":"SUMIF(GİDER!A:G,K3,GİDER!G:G)","v":70},75.44,{"$f":"IF(K3<=$W$1,M3,0)","v":72.94},{"$f":"IF(K3<=$W$1,N3,0)","v":75.44},{"$f":"IF(K3<=$W$1,O3,0)","v":70},{"$f":"-IF(K3<$W$1,L3,0)","v":0},{"$f":"-IF(K3<$W$1,O3,0)","v":0},null,null,{"$f":"-SUM(T:T)","v":0},null,null,{"$f":"-SUM(U:U)","v":0}]
["NO",{"$f":"+W1","v":2016},"BANKADAN ÇEKİLEN PARALAR VE GÖNDERİLEN HAVALELER",{"$f":"+Y2","v":72.94},"NO",{"$f":"+B4","v":2016},"BANKAYA YATIRILAN PARALAR VE GELEN HAVALELER",{"$f":"+Z2","v":75.44},null,null,{"$f":"K3+1","v":2017},{"$f":"SUMIF(GELİRLER!A:G,K4,GELİRLER!G:G)","v":0},{"$f":"SUMIF(BANKA!A:D,K4,BANKA!D:D)","v":0},{"$f":"SUMIF(BANKA!A:E,K4,BANKA!E:E)","v":0},{"$f":"SUMIF(GİDER!A:G,K4,GİDER!G:G)","v":0},0,0,0,0,0,0]
[null,{"$f":"+B4","v":2016},"GEÇMİŞ YILLAR GELİRLERİ DEVİR TUTARI",{"$f":"+X3","v":0},null,{"$f":"+F4","v":2016},"GEÇMİŞ YILLAR GİDERLERİ DEVİR TUTARI",{"$f":"+AA3","v":0},null,null,2018,{"$f":"SUMIF(GELİRLER!A:G,K5,GELİRLER!G:G)","v":0},{"$f":"SUMIF(BANKA!A:D,K5,BANKA!D:D)","v":0},{"$f":"SUMIF(BANKA!A:E,K5,BANKA!E:E)","v":0},{"$f":"SUMIF(GİDER!A:G,K5,GİDER!G:G)","v":0},0,0,0,0,0,0]
[null,{"$f":"+B5","v":2016},"BANKA CARİ HESAP BAKİYESİ",{"$f":"+AC2","v":2.5},null,{"$f":"+F5","v":2016},"KASA BAKİYESİ",{"$f":"+AB2","v":2.9399999999999977},null,null,2019,{"$f":"SUMIF(GELİRLER!A:G,K6,GELİRLER!G:G)","v":0},{"$f":"SUMIF(BANKA!A:D,K6,BANKA!D:D)","v":0},{"$f":"SUMIF(BANKA!A:E,K6,BANKA!E:E)","v":0},{"$f":"SUMIF(GİDER!A:G,K6,GİDER!G:G)","v":0},0,0,0,0,0,0]
[{"$f":"IF(C7>\"\",A6+1,\"\")","v":1},"24.04.2016","1 Nolu Dairenin Şubat-2016 Ayı için Aidat olarak.",35,{"$f":"IF(G7>\"\",E6+1,\"\")","v":1},"25.04.2016","Jkljşlkjlk-Nisan-2016 Ayı- Jhgkhjgkjh",7.5,null,null,2020,{"$f":"SUMIF(GELİRLER!A:G,K7,GELİRLER!G:G)","v":0},{"$f":"SUMIF(BANKA!A:D,K7,BANKA!D:D)","v":0},{"$f":"SUMIF(BANKA!A:E,K7,BANKA!E:E)","v":0},{"$f":"SUMIF(GİDER!A:G,K7,GİDER!G:G)","v":0},0,0,0,0,0,0]
[{"$f":"IF(C8>\"\",A7+1,\"\")","v":2},"24.04.2016","1 Nolu Dairenin Şubat-2016 Ayı için Aidat olarak.",40,{"$f":"IF(G8>\"\",E7+1,\"\")","v":2},"25.04.2016","Kkljkjpoı Iuıouı-Nisan-2016 Ayı- Yuıyuı Uyyuıyo",62.5,null,null,2021,{"$f":"SUMIF(GELİRLER!A:G,K8,GELİRLER!G:G)","v":0},{"$f":"SUMIF(BANKA!A:D,K8,BANKA!D:D)","v":0},{"$f":"SUMIF(BANKA!A:E,K8,BANKA!E:E)","v":0},{"$f":"SUMIF(GİDER!A:G,K8,GİDER!G:G)","v":0},0,0,0,0,0,0]
[{"$f":"IF(C9>\"\",A8+1,\"\")","v":3},"24.04.2016","1 Nolu Dairenin Şubat-2016 Ayı Aidat Borcunun Gecikme Faizi",0.44,null,null,null,null,null,null,2022,{"$f":"SUMIF(GELİRLER!A:G,K9,GELİRLER!G:G)","v":0},{"$f":"SUMIF(BANKA!A:D,K9,BANKA!D:D)","v":0},{"$f":"SUMIF(BANKA!A:E,K9,BANKA!E:E)","v":0},{"$f":"SUMIF(GİDER!A:G,K9,GİDER!G:G)","v":0},0,0,0,0,0,0]
[null,null,null,null,null,null,null,null,null,null,2023,{"$f":"SUMIF(GELİRLER!A:G,K10,GELİRLER!G:G)","v":0},{"$f":"SUMIF(BANKA!A:D,K10,BANKA!D:D)","v":0},{"$f":"SUMIF(BANKA!A:E,K10,BANKA!E:E)","v":0},{"$f":"SUMIF(GİDER!A:G,K10,GİDER!G:G)","v":0},0,0,0,0,0,0]
[null,null,null,null,null,null,null,null,null,null,2024,{"$f":"SUMIF(GELİRLER!A:G,K11,GELİRLER!G:G)","v":0},{"$f":"SUMIF(BANKA!A:D,K11,BANKA!D:D)","v":0},{"$f":"SUMIF(BANKA!A:E,K11,BANKA!E:E)","v":0},{"$f":"SUMIF(GİDER!A:G,K11,GİDER!G:G)","v":0},0,0,0,0,0,0]
[null,null,null,null,null,null,null,null,null,null,2025,{"$f":"SUMIF(GELİRLER!A:G,K12,GELİRLER!G:G)","v":0},{"$f":"SUMIF(BANKA!A:D,K12,BANKA!D:D)","v":0},{"$f":"SUMIF(BANKA!A:E,K12,BANKA!E:E)","v":0},{"$f":"SUMIF(GİDER!A:G,K12,GİDER!G:G)","v":0},0,0,0,0,0,0]
[null,null,null,null,null,null,null,null,null,null,2026,{"$f":"SUMIF(GELİRLER!A:G,K13,GELİRLER!G:G)","v":0},{"$f":"SUMIF(BANKA!A:D,K13,BANKA!D:D)","v":0},{"$f":"SUMIF(BANKA!A:E,K13,BANKA!E:E)","v":0},{"$f":"SUMIF(GİDER!A:G,K13,GİDER!G:G)","v":0},0,0,0,0,0,0]
[null,null,null,null,null,null,null,null,null,null,2027,{"$f":"SUMIF(GELİRLER!A:G,K14,GELİRLER!G:G)","v":0},{"$f":"SUMIF(BANKA!A:D,K14,BANKA!D:D)","v":0},{"$f":"SUMIF(BANKA!A:E,K14,BANKA!E:E)","v":0},{"$f":"SUMIF(GİDER!A:G,K14,GİDER!G:G)","v":0},0,0,0,0,0,0]
[null,null,null,null,null,null,null,null,null,null,2028,{"$f":"SUMIF(GELİRLER!A:G,K15,GELİRLER!G:G)","v":0},{"$f":"SUMIF(BANKA!A:D,K15,BANKA!D:D)","v":0},{"$f":"SUMIF(BANKA!A:E,K15,BANKA!E:E)","v":0},{"$f":"SUMIF(GİDER!A:G,K15,GİDER!G:G)","v":0},0,0,0,0,0,0]
[null,null,null,null,null,null,null,null,null,null,2029,{"$f":"SUMIF(GELİRLER!A:G,K16,GELİRLER!G:G)","v":0},{"$f":"SUMIF(BANKA!A:D,K16,BANKA!D:D)","v":0},{"$f":"SUMIF(BANKA!A:E,K16,BANKA!E:E)","v":0},{"$f":"SUMIF(GİDER!A:G,K16,GİDER!G:G)","v":0},0,0,0,0,0,0]
[null,null,null,null,null,null,null,null,null,null,2030,{"$f":"SUMIF(GELİRLER!A:G,K17,GELİRLER!G:G)","v":0},{"$f":"SUMIF(BANKA!A:D,K17,BANKA!D:D)","v":0},{"$f":"SUMIF(BANKA!A:E,K17,BANKA!E:E)","v":0},{"$f":"SUMIF(GİDER!A:G,K17,GİDER!G:G)","v":0},0,0,0,0,0,0]
[null,null,null,null,null,null,null,null,null,null,2031,{"$f":"SUMIF(GELİRLER!A:G,K18,GELİRLER!G:G)","v":0},{"$f":"SUMIF(BANKA!A:D,K18,BANKA!D:D)","v":0},{"$f":"SUMIF(BANKA!A:E,K18,BANKA!E:E)","v":0},{"$f":"SUMIF(GİDER!A:G,K18,GİDER!G:G)","v":0},0,0,0,0,0,0]
[null,null,null,null,null,null,null,null,null,null,2032,{"$f":"SUMIF(GELİRLER!A:G,K19,GELİRLER!G:G)","v":0},{"$f":"SUMIF(BANKA!A:D,K19,BANKA!D:D)","v":0},{"$f":"SUMIF(BANKA!A:E,K19,BANKA!E:E)","v":0},{"$f":"SUMIF(GİDER!A:G,K19,GİDER!G:G)","v":0},0,0,0,0,0,0]
[null,null,null,null,null,null,null,null,null,null,2033,{"$f":"SUMIF(GELİRLER!A:G,K20,GELİRLER!G:G)","v":0},{"$f":"SUMIF(BANKA!A:D,K20,BANKA!D:D)","v":0},{"$f":"SUMIF(BANKA!A:E,K20,BANKA!E:E)","v":0},{"$f":"SUMIF(GİDER!A:G,K20,GİDER!G:G)","v":0},0,0,0,0,0,0]
[null,null,null,null,null,null,null,null,null,null,2034,{"$f":"SUMIF(GELİRLER!A:G,K21,GELİRLER!G:G)","v":0},{"$f":"SUMIF(BANKA!A:D,K21,BANKA!D:D)","v":0},{"$f":"SUMIF(BANKA!A:E,K21,BANKA!E:E)","v":0},{"$f":"SUMIF(GİDER!A:G,K21,GİDER!G:G)","v":0},0,0,0,0,0,0]
[null,null,null,null,null,null,null,null,null,null,2035,{"$f":"SUMIF(GELİRLER!A:G,K22,GELİRLER!G:G)","v":0},{"$f":"SUMIF(BANKA!A:D,K22,BANKA!D:D)","v":0},{"$f":"SUMIF(BANKA!A:E,K22,BANKA!E:E)","v":0},{"$f":"SUMIF(GİDER!A:G,K22,GİDER!G:G)","v":0},0,0,0,0,0,0]
[null,null,null,null,null,null,null,null,null,null,2036,{"$f":"SUMIF(GELİRLER!A:G,K23,GELİRLER!G:G)","v":0},{"$f":"SUMIF(BANKA!A:D,K23,BANKA!D:D)","v":0},{"$f":"SUMIF(BANKA!A:E,K23,BANKA!E:E)","v":0},{"$f":"SUMIF(GİDER!A:G,K23,GİDER!G:G)","v":0},0,0,0,0,0,0]
[null,null,null,null,null,null,null,null,null,null,2037,{"$f":"SUMIF(GELİRLER!A:G,K24,GELİRLER!G:G)","v":0},{"$f":"SUMIF(BANKA!A:D,K24,BANKA!D:D)","v":0},{"$f":"SUMIF(BANKA!A:E,K24,BANKA!E:E)","v":0},{"$f":"SUMIF(GİDER!A:G,K24,GİDER!G:G)","v":0},0,0,0,0,0,0]
[null,null,null,null,null,null,null,null,null,null,2038,{"$f":"SUMIF(GELİRLER!A:G,K25,GELİRLER!G:G)","v":0},{"$f":"SUMIF(BANKA!A:D,K25,BANKA!D:D)","v":0},{"$f":"SUMIF(BANKA!A:E,K25,BANKA!E:E)","v":0},{"$f":"SUMIF(GİDER!A:G,K25,GİDER!G:G)","v":0},0,0,0,0,0,0]
[null,null,null,null,null,null,null,null,null,null,2039,{"$f":"SUMIF(GELİRLER!A:G,K26,GELİRLER!G:G)","v":0},{"$f":"SUMIF(BANKA!A:D,K26,BANKA!D:D)","v":0},{"$f":"SUMIF(BANKA!A:E,K26,BANKA!E:E)","v":0},{"$f":"SUMIF(GİDER!A:G,K26,GİDER!G:G)","v":0},0,0,0,0,0,0]
[null,null,null,null,null,null,null,null,null,null,2040,{"$f":"SUMIF(GELİRLER!A:G,K27,GELİRLER!G:G)","v":0},{"$f":"SUMIF(BANKA!A:D,K27,BANKA!D:D)","v":0},{"$f":"SUMIF(BANKA!A:E,K27,BANKA!E:E)","v":0},{"$f":"SUMIF(GİDER!A:G,K27,GİDER!G:G)","v":0},0,0,0,0,0,0]
[null,null,null,null,null,null,null,null,null,null,2041,{"$f":"SUMIF(GELİRLER!A:G,K28,GELİRLER!G:G)","v":0},{"$f":"SUMIF(BANKA!A:D,K28,BANKA!D:D)","v":0},{"$f":"SUMIF(BANKA!A:E,K28,BANKA!E:E)","v":0},{"$f":"SUMIF(GİDER!A:G,K28,GİDER!G:G)","v":0},0,0,0,0,0,0]
[null,null,null,null,null,null,null,null,null,null,2042,{"$f":"SUMIF(GELİRLER!A:G,K29,GELİRLER!G:G)","v":0},{"$f":"SUMIF(BANKA!A:D,K29,BANKA!D:D)","v":0},{"$f":"SUMIF(BANKA!A:E,K29,BANKA!E:E)","v":0},{"$f":"SUMIF(GİDER!A:G,K29,GİDER!G:G)","v":0},0,0,0,0,0,0]
[null,null,null,null,null,null,null,null,null,null,2043,{"$f":"SUMIF(GELİRLER!A:G,K30,GELİRLER!G:G)","v":0},{"$f":"SUMIF(BANKA!A:D,K30,BANKA!D:D)","v":0},{"$f":"SUMIF(BANKA!A:E,K30,BANKA!E:E)","v":0},{"$f":"SUMIF(GİDER!A:G,K30,GİDER!G:G)","v":0},0,0,0,0,0,0]
[null,null,null,null,null,null,null,null,null,null,2044,{"$f":"SUMIF(GELİRLER!A:G,K31,GELİRLER!G:G)","v":0},{"$f":"SUMIF(BANKA!A:D,K31,BANKA!D:D)","v":0},{"$f":"SUMIF(BANKA!A:E,K31,BANKA!E:E)","v":0},{"$f":"SUMIF(GİDER!A:G,K31,GİDER!G:G)","v":0},0,0,0,0,0,0]
[null,null,null,null,null,null,null,null,null,null,2045,{"$f":"SUMIF(GELİRLER!A:G,K32,GELİRLER!G:G)","v":0},{"$f":"SUMIF(BANKA!A:D,K32,BANKA!D:D)","v":0},{"$f":"SUMIF(BANKA!A:E,K32,BANKA!E:E)","v":0},{"$f":"SUMIF(GİDER!A:G,K32,GİDER!G:G)","v":0},0,0,0,0,0,0]
[null,null,null,null,null,null,null,null,null,null,2046,{"$f":"SUMIF(GELİRLER!A:G,K33,GELİRLER!G:G)","v":0},{"$f":"SUMIF(BANKA!A:D,K33,BANKA!D:D)","v":0},{"$f":"SUMIF(BANKA!A:E,K33,BANKA!E:E)","v":0},{"$f":"SUMIF(GİDER!A:G,K33,GİDER!G:G)","v":0},0,0,0,0,0,0]
[null,null,null,null,null,null,null,null,null,null,2047,{"$f":"SUMIF(GELİRLER!A:G,K34,GELİRLER!G:G)","v":0},{"$f":"SUMIF(BANKA!A:D,K34,BANKA!D:D)","v":0},{"$f":"SUMIF(BANKA!A:E,K34,BANKA!E:E)","v":0},{"$f":"SUMIF(GİDER!A:G,K34,GİDER!G:G)","v":0},0,0,0,0,0,0]
[null,null,null,null,null,null,null,null,null,null,2048,{"$f":"SUMIF(GELİRLER!A:G,K35,GELİRLER!G:G)","v":0},{"$f":"SUMIF(BANKA!A:D,K35,BANKA!D:D)","v":0},{"$f":"SUMIF(BANKA!A:E,K35,BANKA!E:E)","v":0},{"$f":"SUMIF(GİDER!A:G,K35,GİDER!G:G)","v":0},0,0,0,0,0,0]
[null,null,null,null,null,null,null,null,null,null,2049,{"$f":"SUMIF(GELİRLER!A:G,K36,GELİRLER!G:G)","v":0},{"$f":"SUMIF(BANKA!A:D,K36,BANKA!D:D)","v":0},{"$f":"SUMIF(BANKA!A:E,K36,BANKA!E:E)","v":0},{"$f":"SUMIF(GİDER!A:G,K36,GİDER!G:G)","v":0},0,0,0,0,0,0]
[null,null,null,null,null,null,null,null,null,null,2050,{"$f":"SUMIF(GELİRLER!A:G,K37,GELİRLER!G:G)","v":0},{"$f":"SUMIF(BANKA!A:D,K37,BANKA!D:D)","v":0},{"$f":"SUMIF(BANKA!A:E,K37,BANKA!E:E)","v":0},{"$f":"SUMIF(GİDER!A:G,K37,GİDER!G:G)","v":0},0,0,0,0,0,0]
[null,null,null,null,null,null,null,null,null,null,2051,{"$f":"SUMIF(GELİRLER!A:G,K38,GELİRLER!G:G)","v":0},{"$f":"SUMIF(BANKA!A:D,K38,BANKA!D:D)","v":0},{"$f":"SUMIF(BANKA!A:E,K38,BANKA!E:E)","v":0},{"$f":"SUMIF(GİDER!A:G,K38,GİDER!G:G)","v":0},0,0,0,0,0,0]
[null,null,null,null,null,null,null,null,null,null,2052,{"$f":"SUMIF(GELİRLER!A:G,K39,GELİRLER!G:G)","v":0},{"$f":"SUMIF(BANKA!A:D,K39,BANKA!D:D)","v":0},{"$f":"SUMIF(BANKA!A:E,K39,BANKA!E:E)","v":0},{"$f":"SUMIF(GİDER!A:G,K39,GİDER!G:G)","v":0},0,0,0,0,0,0]
[null,null,null,null,null,null,null,null,null,null,2053,{"$f":"SUMIF(GELİRLER!A:G,K40,GELİRLER!G:G)","v":0},{"$f":"SUMIF(BANKA!A:D,K40,BANKA!D:D)","v":0},{"$f":"SUMIF(BANKA!A:E,K40,BANKA!E:E)","v":0},{"$f":"SUMIF(GİDER!A:G,K40,GİDER!G:G)","v":0},0,0,0,0,0,0]
[null,null,null,null,null,null,null,null,null,null,2054,{"$f":"SUMIF(GELİRLER!A:G,K41,GELİRLER!G:G)","v":0},{"$f":"SUMIF(BANKA!A:D,K41,BANKA!D:D)","v":0},{"$f":"SUMIF(BANKA!A:E,K41,BANKA!E:E)","v":0},{"$f":"SUMIF(GİDER!A:G,K41,GİDER!G:G)","v":0},0,0,0,0,0,0]
[null,null,null,null,null,null,null,null,null,null,2055,{"$f":"SUMIF(GELİRLER!A:G,K42,GELİRLER!G:G)","v":0},{"$f":"SUMIF(BANKA!A:D,K42,BANKA!D:D)","v":0},{"$f":"SUMIF(BANKA!A:E,K42,BANKA!E:E)","v":0},{"$f":"SUMIF(GİDER!A:G,K42,GİDER!G:G)","v":0},0,0,0,0,0,0]

{"sheet":"BANKA","index":8,"n_rows":4,"n_cols":6,"rows_kept":4,"cut":false,"hidden":false,"merged":[]}
["YIL","TARİH","AÇIKLAMA","ÇEKİLEN","YATAN","KALAN"]
[2016,25042016,"Yatan",null,75.44,{"$f":"SUM(E:E)-SUM(D:D)","v":2.5}]
[2016,25042016,"Çekilen",65.44]
[2016,"25.04.2016","Jkljşlkjlk-Nisan-2016 Ayı- Jhgkhjgkjh",7.5]

{"sheet":"TEDARİKÇİLER","index":9,"n_rows":1,"n_cols":6,"rows_kept":1,"cut":false,"hidden":false,"merged":[]}
["FİRMA / KİŞİ - ÜNVANI / ADI SOYADI","YETKİLİ ADI SOYADI","ADRESİ","TELEFONU","VERGİ DAİRESİ","VERGİ / T.C. NO"]

{"sheet":"HANE","index":10,"n_rows":11,"n_cols":34,"rows_kept":11,"cut":false,"hidden":false,"merged":[]}
["DAİRE","ADI SOYADI","YAKINLIĞI","İKAMET BAŞLAMA","İKAMET AYRILMA","EVLİLİK TARİHİ","ARAÇ PLAKA","ANAHTAR",null,null,null,null,null,null,null,null,null,null,null,null,null,null,null,null,null,null,"DAİRE","ADI SOYADI","YAKINLIĞI","İKAMET BAŞLAMA","İKAMET AYRILMA","EVLİLİK TARİHİ","ARAÇ PLAKA","ANAHTAR"]
[null,null,null,null,null,null,null,"1-Yeşim Tuncay Şahbaz",null,null,null,null,null,null,null,null,null,null,null,null,null,null,null,null,null,null,11,"Murat Şahin","Kendisi",null,null,null,null,"11-Murat Şahin"]
[null,null,null,null,null,null,null,"2-Hakverdi Yılmaz"]
[null,null,null,null,null,null,null,"3-Kudret Ünsal"]
[null,null,null,null,null,null,null,"9-Memduh Toy"]
[null,null,null,null,null,null,null,"11-Murat Şahin"]
[null,null,null,null,null,null,null,"12-Murat Toy"]
[null,null,null,null,null,null,null,"13-Salim Toy"]
[null,null,null,null,null,null,null,"16-Gültaza Gümüş"]
[null,null,null,null,null,null,null,"18-Cuma Keskiner"]
[null,null,null,null,null,null,null,"41-Osman Ülkü Şanlı"]

{"sheet":"HAZİRUN","index":11,"n_rows":1,"n_cols":3,"rows_kept":1,"cut":false,"hidden":false,"merged":[]}
["DAİRE NO","KATILIMCI ADI SOYADI","İMZASI"]

{"sheet":"APT","index":12,"n_rows":10,"n_cols":2,"rows_kept":10,"cut":false,"hidden":false,"merged":[]}
["SİTE KULLANIM ALANI M2",{"$f":"SUM(ÜYE!C:C)","v":274}]
["SİTE ORTAK KULLANIM M2",50]
["APARTMAN/SİTE ADI","Ata"]
["ADRESİ","Akşemsettin Mah.1106/1 Sok.No:4"]
["İLİ","Ankara"]
["İLÇESİ","Mamak"]
["DAİRE / DÜKKAN SAYISI ","44"]
["ADA NO","51002"]
["PARSEL NO","4"]
["KAT SAYISI","12"]

{"sheet":"HAZIRLIK","index":13,"n_rows":127,"n_cols":2,"rows_kept":127,"cut":false,"hidden":false,"merged":[[123,0,123,3],[124,0,124,3],[125,0,125,3],[126,0,126,3],[118,0,118,3],[119,0,119,3],[120,0,120,3],[121,0,121,3],[122,0,122,3],[117,0,117,3],[106,0,106,3],[107,0,107,3],[108,0,108,3],[109,0,109,3],[110,0,110,3],[111,0,111,3],[112,0,112,3],[113,0,113,3],[114,0,114,3],[115,0,115,3],[116,0,116,3],[105,0,105,3],[95,0,95,3],[97,0,97,3],[98,0,98,3],[99,0,99,3],[100,0,100,3],[101,0,101,3],[102,0,102,3],[103,0,103,3],[104,0,104,3],[23,0,23,3],[12,0,12,3],[13,0,13,3],[14,0,14,3],[15,0,15,3],[16,0,16,3],[17,0,17,3],[18,0,18,3],[19,0,19,3],[20,0,20,3],[21,0,21,3],[22,0,22,3],[11,0,11,3],[0,0,0,3],[1,0,1,3],[2,0,2,3],[3,0,3,3],[4,0,4,3],[5,0,5,3],[6,0,6,3],[7,0,7,3],[8,0,8,3],[9,0,9,3],[10,0,10,3]]}
["KARARLAR"]
[]
[{"$f":"\"1.)Kat malikleri kurulu , yoklama yapıldı ve gerekli ekseriyetin hazır bulunduğu tespit edilerek gündemin görüşülmesi için Toplantı Divan başkanlığına \"&B87&\", katipliğe \"&B88&\" tüm maliklerin kabul oy birliği ile seçildi.\"","v":"1.)Kat malikleri kurulu , yoklama yapıldı ve gerekli ekseriyetin hazır bulunduğu tespit edilerek gündemin görüşülmesi için Toplantı Divan başkanlığına Murat Gücükdeli, katipliğe Serap Gücükdeli tüm maliklerin kabul oy birliği ile seçildi."}]
["2.) Yönetimin Yıllık Faaliyet raporu incelenip gelir ve giderler kabul edip ibra edildi."]
["3.)Denetici raporu okunup kabul edilip ibra edildi."]
[{"$f":"\"4.) Divan Başkanı tarafından yönetici adayı olarak profesyonel bilgi birikimi bulunan \"&B79&\" ve Yönetici Yardımcılığına/Yardımcılıklarına \"&B80&\"   \"&B81&\" önerildi. Denetici olarak \"&B82&\" ve Denetici Yardımcılığına/Yardımcılıklarına \"&B83&\"  \"&B84&\"   \"&B85&\" önerildi. Konu oylamaya sunuldu. Yönetici \"&B79&\" ve Yönetici Yardımcılığına/Yardımcılıklarına \"&B80&\"   \"&B81&\" ve Denetici \"&B82&\" ve Denetici Yardımcılığına \"&B83&\"  \"&B84&\"   \"&B85&\" olarak seçilmesine oy birliği ile karar verildi.\"","v":"4.) Divan Başkanı tarafından yönetici adayı olarak profesyonel bilgi birikimi bulunan Bilal Yılmaz ve Yönetici Yardımcılığına/Yardımcılıklarına Halil Şahbaz   Zülfiye Şahbaz önerildi. Denetici olarak Fatih Toklucu ve Denetici Yardımcılığına/Yardımcılıklarına Fatma Toklucu  Seher Toklucu   Selva Toklucu önerildi. Konu oylamaya sunuldu. Yönetici Bilal Yılmaz ve Yönetici Yardımcılığına/Yardımcılıklarına Halil Şahbaz   Zülfiye Şahbaz ve Denetici Fatih Toklucu ve Denetici Yardımcılığına Fatma Toklucu  Seher Toklucu   Selva Toklucu olarak seçilmesine oy birliği ile karar verildi."}]
[{"$f":"\"Yönetici \"&B79&\" ve veya denetici \"&B82&\"'a Apartman/Site'ye ait tüm bankacılık işlemlerini yapmaya ve tüm resmi ve özel kurumlarda binayı münferiden veya ayrı ayrı temsil etmesine oy birliği ile karar verilmiştir. \"&B82&\"'a Apartmanın/Sitenin avans aidat ve yatırım aylık ödemelerinden doğan alacakları hususunda toplam borcu \"&B75*12&\".-TL'yi geçen maliklerin Avukat kanalıyla icra takibi yapılması hususunda bir avukata \"&APT!B3&\" Apartmanı adına vekalet vermesi hususunda yetki verilmiştir.\"","v":"Yönetici Bilal Yılmaz ve veya denetici Fatih Toklucu'a Apartman/Site'ye ait tüm bankacılık işlemlerini yapmaya ve tüm resmi ve özel kurumlarda binayı münferiden veya ayrı ayrı temsil etmesine oy birliği ile karar verilmiştir. Fatih Toklucu'a Apartmanın/Sitenin avans aidat ve yatırım aylık ödemelerinden doğan alacakları hususunda toplam borcu 180.-TL'yi geçen maliklerin Avukat kanalıyla icra takibi yapılması hususunda bir avukata Ata Apartmanı adına vekalet vermesi hususunda yetki verilmiştir."}]
[{"$f":"\"Yönetici \"&B79&\"'a \"&B90&\" TL. Yönetim huzur hakkı ödenmesine karar verildi. Deneticiye bir ücret ödenmesine gerek olmadığına oy birliğiyle karar verildi.\"","v":"Yönetici Bilal Yılmaz'a 150 TL. Yönetim huzur hakkı ödenmesine karar verildi. Deneticiye bir ücret ödenmesine gerek olmadığına oy birliğiyle karar verildi."}]
[{"$f":"\"5.) İkinci bir karar alınıncaya kadar avans aidatlarının yapılan işletme projesinin oy birliği ile kabul edilmesiyle bağımsız bölüm başına \"&B75&\".-TL/Ay toplanmasına karar verilmiştir.\"","v":"5.) İkinci bir karar alınıncaya kadar avans aidatlarının yapılan işletme projesinin oy birliği ile kabul edilmesiyle bağımsız bölüm başına 15.-TL/Ay toplanmasına karar verilmiştir."}]
["6.) Dilek ve temennilere gelindi apartmanımızın elektrik, su gibi giderlerinin Türkiyede yerleşik bir Bankada açılacak yönetim hesabından otomatik ödeme talimatlarıyla düzenli olarak yapılması hususlarına oy birliği ile karar verildi."]
["Kararlar oy birliği ile imza altına alınarak toplantı kapatıldı."]
[{"$f":"B77","v":"15.10.2015"}]
[]
["KARARLAR"]
["1.)Kat Malikleri Kurulu , Yoklama Yapıldı Ve Gerekli Ekseriyetin Hazır Bulunduğu Tespit Edilerek Gündemin Görüşülmesi İçin Toplantı Divan Başkanlığına Murat Gücükdeli, Katipliğe Serap Gücükdeli Tüm Maliklerin Kabul Oy Birliği İle Seçildi."]
["2.) Yönetimin Yıllık Faaliyet Raporu İncelenip Gelir Ve Giderler Kabul Edip İbra Edildi."]
["3.)Denetici Raporu Okunup Kabul Edilip İbra Edildi."]
["4.) Divan Başkanı Tarafından Yönetici Adayı Olarak Profesyonel Bilgi Birikimi Bulunan Bilal Yılmaz Ve Yönetici Yardımcılığına/Yardımcılıklarına Halil Şahbaz   Zülfiye Şahbaz Önerildi. Denetici Olarak Fatih Toklucu Ve Denetici Yardımcılığına/Yardımcılıklarına Fatma Toklucu  Seher Toklucu   Selva Toklucu Önerildi. Konu Oylamaya Sunuldu. Yönetici Bilal Yılmaz Ve Yönetici Yardımcılığına/Yardımcılıklarına Halil Şahbaz   Zülfiye Şahbaz Ve Denetici Fatih Toklucu Ve Denetici Yardımcılığına Fatma Toklucu  Seher Toklucu   Selva Toklucu Olarak Seçilmesine Oy Birliği İle Karar Verildi."]
["Yönetici Bilal Yılmaz Ve Veya Denetici Fatih Toklucu'A Apartman/Site'Ye Ait Tüm Bankacılık İşlemlerini Yapmaya Ve Tüm Resmi Ve Özel Kurumlarda Binayı Münferiden Veya Ayrı Ayrı Temsil Etmesine Oy Birliği İle Karar Verilmiştir. Fatih Toklucu'A Apartmanın/Sitenin Avans Aidat Ve Yatırım Aylık Ödemelerinden Doğan Alacakları Hususunda Toplam Borcu 180.-Tl'Yi Geçen Maliklerin Avukat Kanalıyla İcra Takibi Yapılması Hususunda Bir Avukata Işıl-3 Apartmanı Adına Vekalet Vermesi Hususunda Yetki Verilmiştir."]
["Yönetici Bilal Yılmaz'A 150 Tl. Yönetim Huzur Hakkı Ödenmesine Karar Verildi. Deneticiye Bir Ücret Ödenmesine Gerek Olmadığına Oy Birliğiyle Karar Verildi."]
["5.) İkinci Bir Karar Alınıncaya Kadar Avans Aidatlarının Yapılan İşletme Projesinin Oy Birliği İle Kabul Edilmesiyle Bağımsız Bölüm Başına 15.-Tl/Ay Toplanmasına Karar Verilmiştir."]
["6.) Dilek Ve Temennilere Gelindi Apartmanımızın Elektrik, Su Gibi Giderlerinin Türkiyede Yerleşik Bir Bankada Açılacak Yönetim Hesabından Otomatik Ödeme Talimatlarıyla Düzenli Olarak Yapılması Hususlarına Oy Birliği İle Karar Verildi."]
["Kararlar Oy Birliği İle İmza Altına Alınarak Toplantı Kapatıldı."]
["15.04.2016"]
[]
[]
[]
[]
[]
[]
[]
[]
[]
[]
[]
[]
[]
[]
[]
[]
[]
[]
[]
[]
[]
[]
[]
[]
[]
[]
[]
[]
[]
[]
[]
[]
[]
[]
[]
[]
[]
[]
[]
[]
[]
[]
[]
[]
[]
[]
[]
[]
[]
[]
["AYLIK AİDAT TUTARI (MESKEN)",15]
["AYLIK AİDAT TUTARI (DÜKKAN)",0]
["1.TOPLANTI TARİHİ (AYIN İLK 10.GÜNÜ)","15.10.2015"]
["VEYA 2.TOPLANTI TARİHİ (AYIN İLK 10.GÜNÜ)","15.11.2015"]
["SEÇİLEN YÖNETİCİ ","Bilal Yılmaz"]
["YÖNETİCİ YARDIMCISI  1","Halil Şahbaz"]
["YÖNETİCİ YARDIMCISI  2","Zülfiye Şahbaz"]
["1.DENETÇİ","Fatih Toklucu"]
["2.DENETÇİ","Fatma Toklucu"]
["3.DENETÇİ","Seher Toklucu"]
["4.DENETÇİ","Selva Toklucu"]
["TOPLANTIYA DAVET TARİHİ","15.09.2015"]
["DİVAN BAŞKANI","Murat Gücükdeli"]
["KATİP","Serap Gücükdeli"]
["YÖNETİCİ AİDAT ÖDEYECEK Mİ.?","Öder"]
["HUZUR HAKKI",150]
[]
[]
[]
[]
[]
["Kat Malikleri Kuruluna Davet Mektubu"]
[]
[{"$f":"APT!B3&\" Apartmanı Kat Maliklerine;\"","v":"Ata Apartmanı Kat Maliklerine;"}]
[{"$f":"\"Kat malikleri kurulu,aşağıdaki gündem maddelerini görüşüp karara bağlamak üzere \"&B77&\" da \"&APT!B4&\" adresindeki apartmanda olağan (veya olağanüstü) olarak toplanacaktır.\"","v":"Kat malikleri kurulu,aşağıdaki gündem maddelerini görüşüp karara bağlamak üzere 15.10.2015 da Akşemsettin Mah.1106/1 Sok.No:4 adresindeki apartmanda olağan (veya olağanüstü) olarak toplanacaktır."}]
[{"$f":"\"Bu toplantıda yeter sayı sağlanamadığı takdirde,ikinci toplantı nisap (çoğunluk) aranmaksızın \"&B78&\" da aynı yerde yapılacaktır.\"","v":"Bu toplantıda yeter sayı sağlanamadığı takdirde,ikinci toplantı nisap (çoğunluk) aranmaksızın 15.11.2015 da aynı yerde yapılacaktır."}]
[{"$f":"\"Bütün kat maliklerinin toplantıya katılmaları veya kendilerini temsil ettirmeleri önemle rica olunur.\"&B86","v":"Bütün kat maliklerinin toplantıya katılmaları veya kendilerini temsil ettirmeleri önemle rica olunur.15.09.2015"}]
["Gündem:"]
["1)Açılış,Yoklama Ve Toplantı Divan Başkanı Ve Üyelerin Seçimi,"]
["2)Başkanlık Panına İmza Yetkisi Verilmesi"]
["3)Gündemin Okunması Ve İlaveler"]
["4)Yönetici Faaliyet Raporu Ve Denetçi Raporunun Okunması, Hesapların Görüşülmesi Ve Yöneticinin İbrası."]
["5)Yeni Yönetici Ve Denetçi Seçimi."]
["6)Dilek Ve Temenniler."]
["7)Kapanış."]
[]
[]
[]
[]
[{"$f":"B4&\"                                                                                                                                                                      Apartmanı Yöneticisi\"","v":"                                                                                                                                                                      Apartmanı Yöneticisi"}]
[{"$f":"+B79","v":"Bilal Yılmaz"}]
["———————————————————————————————————————————"]
["VEKALETNAME"]
[{"$f":"APT!B3&\" Apartmanı/Sitesi kat malikleri kurulu divan başkanlığına\"","v":"Ata Apartmanı/Sitesi kat malikleri kurulu divan başkanlığına"}]
[{"$f":"\"Sitemizin \"&B77&\" tarihinde yapılacak olan kat malikleri kurulu toplantısında beni temsile (Kat Malikimiz / Birinci derece akrabam) ………………………..………………………………………… vekil olarak tayin ettim.\"","v":"Sitemizin 15.10.2015 tarihinde yapılacak olan kat malikleri kurulu toplantısında beni temsile (Kat Malikimiz / Birinci derece akrabam) ………………………..………………………………………… vekil olarak tayin ettim."}]
["………………………………...…….. nolu kat maliki"]
["Adı Soyadı   :"]
["İmza"]
["Not :"]
["1.Bir kat maliki diğer kat maliki veya 1. derece akrabası tarafından temsil edilir."]
["2.Bağımsız bölümün birden fazla maliki varsa, içlerinden birine vekalet vererek bu kişi tarafından temsil edilirler."]
["3.Birden fazla bağımsız bölüm sahibi her bölüm için bir oy hakkına sahiptir."]
["4.Vefat eden kat malikini veraset ilamı ile birlikte aralarından seçecekleri kişi temsil eder."]

{"sheet":"MAKBUZ","index":14,"n_rows":49,"n_cols":4,"rows_kept":49,"cut":false,"hidden":false,"merged":[[0,0,0,3],[6,0,6,3],[7,0,7,3],[24,0,24,3],[25,0,25,3],[30,0,30,3],[31,0,31,3],[9,0,9,3],[15,0,15,3],[16,0,16,3],[17,0,17,3],[20,0,20,3],[35,0,35,3],[39,0,39,3],[40,0,40,3],[45,0,45,3],[46,0,46,3]]}
[{"$f":"APT!B3&\" Aptartmanı/Sitesi \" &\"                                                                                                                           Para Teslim Makbuzu\"","v":"Ata Aptartmanı/Sitesi                                                                                                                            Para Teslim Makbuzu"}]
["ADI SOYADI","DAİRE NO ","TARİH","TUTAR"]
["Dilek Arslan","3","29.10.2016",39.840000000000003]
[null,null,"AY BORCU",29.45]
[null,null,"FAİZ",10.84]
[]
["Sitemiz/Apartmanımız Sakini Dilek Arslan, 3 No'lu Dairesi/Dükkanı için 29.10.2016 Tarihinde Şubat-2016 Ayı Diğer Tahsilat olarak 29,45 TL.  TL.Gecikme Faizi olarak 10.84 TL.olmak üzere Toplam : 39.84 TL. Teslim etmiştir."]
["İşbu Makbuz Dilek Arslan'e kendi isteği üzerine düzenlenmiş ve imza edilmiştir."]
[]
[{"$f":"+A1","v":"Ata Aptartmanı/Sitesi                                                                                                                            Para Teslim Makbuzu"}]
[{"$f":"+A2","v":"ADI SOYADI"},{"$f":"+B2","v":"DAİRE NO "},"TARİH","TUTAR"]
[{"$f":"+A3","v":"Dilek Arslan"},{"$f":"+B3","v":"3"},{"$f":"+C3","v":"29.10.2016"},{"$f":"+D3","v":39.840000000000003}]
[null,null,{"$f":"+C4","v":"AY BORCU"},29.45]
[null,null,{"$f":"+C5","v":"FAİZ"},10.84]
[]
[{"$f":"+A7","v":"Sitemiz/Apartmanımız Sakini Dilek Arslan, 3 No'lu Dairesi/Dükkanı için 29.10.2016 Tarihinde Şubat-2016 Ayı Diğer Tahsilat olarak 29,45 TL.  TL.Gecikme Faizi olarak 10.84 TL.olmak üzere Toplam : 39.84 TL. Teslim etmiştir."}]
[{"$f":"+A8","v":"İşbu Makbuz Dilek Arslan'e kendi isteği üzerine düzenlenmiş ve imza edilmiştir."}]
[]
[]
[]
[{"$f":"APT!B3&\" Aptartmanı/Sitesi \"&\"                                                                                                                           GİDER MAKBUZU\"","v":"Ata Aptartmanı/Sitesi                                                                                                                            GİDER MAKBUZU"}]
["ÖDEME YAPILAN KİŞİ (ADI SOYADI)","KİMLİK NO / VKN","TARİH","TUTAR"]
["kkljkjpoı ıuıouı",null,"25.04.2016","62,5"]
[]
["İŞİN MAHİYETİ"]
["yuıyuı uyyuıyo"]
[]
[]
[]
[]
["Yukarıda mahiyeti yazılı iş,  TC.Kimlik / VKN. nolu kkljkjpoı ıuıouı 'a 25.04.2016 tarihinde yaptırılmış olup, 62,5 TL. ödenmiştir."]
["yuıyuı uyyuıyo işi karşılığı 62,5.- TL.yi nakden ve tamamen aldım."]
["kkljkjpoı ıuıouı",null,{"$f":"HAZIRLIK!B79","v":"Bilal Yılmaz"}]
["(İmza)",null,"(İmza)"]
[]
[{"$f":"+A21","v":"Ata Aptartmanı/Sitesi                                                                                                                            GİDER MAKBUZU"}]
[{"$f":"+A22","v":"ÖDEME YAPILAN KİŞİ (ADI SOYADI)"},{"$f":"+B22","v":"KİMLİK NO / VKN"},"TARİH","TUTAR"]
[{"$f":"+A23","v":"kkljkjpoı ıuıouı"},{"$f":"+B23","v":0},"25.04.2016","62,5"]
[]
[{"$f":"+A25","v":"İŞİN MAHİYETİ"}]
[{"$f":"+A26","v":"yuıyuı uyyuıyo"}]
[]
[]
[]
[]
[{"$f":"+A31","v":"Yukarıda mahiyeti yazılı iş,  TC.Kimlik / VKN. nolu kkljkjpoı ıuıouı 'a 25.04.2016 tarihinde yaptırılmış olup, 62,5 TL. ödenmiştir."}]
[{"$f":"+A32","v":"yuıyuı uyyuıyo işi karşılığı 62,5.- TL.yi nakden ve tamamen aldım."}]
[{"$f":"+A33","v":"kkljkjpoı ıuıouı"},null,{"$f":"+C33","v":"Bilal Yılmaz"}]
[{"$f":"+A34","v":"(İmza)"},null,{"$f":"+C34","v":"(İmza)"}]

{"sheet":"GKKARAR","index":15,"n_rows":3,"n_cols":11,"rows_kept":3,"cut":false,"hidden":false,"merged":[]}
["MADDE","KARARLAR","KARARLAR","KARARLAR","KARARLAR","KARARLAR","KARARLAR","KARARLAR","KARARLAR","KARARLAR","TARİH"]
[1,{"$f":"\"1.)Kat malikleri kurulu , yoklama yapıldı ve gerekli ekseriyetin hazır bulunduğu tespit edilerek gündemin görüşülmesi için Toplantı Divan başkanlığına \"&CH3&\", katipliğe \"&CI3&\" tüm maliklerin kabul oy birliği ile seçildi.\"","v":"1.)Kat malikleri kurulu , yoklama yapıldı ve gerekli ekseriyetin hazır bulunduğu tespit edilerek gündemin görüşülmesi için Toplantı Divan başkanlığına , katipliğe  tüm maliklerin kabul oy birliği ile seçildi."},"2.) Yönetimin Yıllık Faaliyet raporu incelenip gelir ve giderler kabul edip ibra edildi.","3.)Denetici raporu okunup kabul edilip ibra edildi.",{"$f":"\"4.) Divan Başkanı tarafından yönetici adayı olarak profesyonel bilgi birikimi bulunan \"&BZ3&\" ve Yönetici Yardımcılığına/Yardımcılıklarına \"&CA3&\"   \"&CB3&\" önerildi. Denetici olarak \"&CC3&\" ve Denetici Yardımcılığına/Yardımcılıklarına \"&CD3&\"  \"&CE3&\"   \"&CF3&\" önerildi. Konu oylamaya sunuldu. Yönetici \"&BZ3&\" ve Yönetici Yardımcılığına/Yardımcılıklarına \"&CA3&\"   \"&CB3&\" ve Denetici \"&CC3&\" ve Denetici Yardımcılığına \"&CD3&\"  \"&CE3&\"   \"&CF3&\" olarak seçilmesine oy birliği ile karar verildi.\"","v":"4.) Divan Başkanı tarafından yönetici adayı olarak profesyonel bilgi birikimi bulunan  ve Yönetici Yardımcılığına/Yardımcılıklarına     önerildi. Denetici olarak  ve Denetici Yardımcılığına/Yardımcılıklarına       önerildi. Konu oylamaya sunuldu. Yönetici  ve Yönetici Yardımcılığına/Yardımcılıklarına     ve Denetici  ve Denetici Yardımcılığına       olarak seçilmesine oy birliği ile karar verildi."},{"$f":"\"Yönetici \"&BZ3&\" ve veya denetici \"&CC3&\"'a Apartman/Site'ye ait tüm bankacılık işlemlerini yapmaya ve tüm resmi ve özel kurumlarda binayı münferiden veya ayrı ayrı temsil etmesine oy birliği ile karar verilmiştir. \"&CC3&\"'a Apartmanın/Sitenin avans aidat ve yatırım aylık ödemelerinden doğan alacakları hususunda toplam borcu \"&BV3*12&\".-TL'yi geçen maliklerin Avukat kanalıyla icra takibi yapılması hususunda bir avukata \"&APT!B3&\" Apartmanı adına vekalet vermesi hususunda yetki verilmiştir.\"","v":"Yönetici  ve veya denetici 'a Apartman/Site'ye ait tüm bankacılık işlemlerini yapmaya ve tüm resmi ve özel kurumlarda binayı münferiden veya ayrı ayrı temsil etmesine oy birliği ile karar verilmiştir. 'a Apartmanın/Sitenin avans aidat ve yatırım aylık ödemelerinden doğan alacakları hususunda toplam borcu 0.-TL'yi geçen maliklerin Avukat kanalıyla icra takibi yapılması hususunda bir avukata Ata Apartmanı adına vekalet vermesi hususunda yetki verilmiştir."},{"$f":"\"Yönetici \"&BZ3&\"'a \"&CK3&\" TL. Yönetim huzur hakkı ödenmesine karar verildi. Deneticiye bir ücret ödenmesine gerek olmadığına oy birliğiyle karar verildi.\"","v":"Yönetici 'a  TL. Yönetim huzur hakkı ödenmesine karar verildi. Deneticiye bir ücret ödenmesine gerek olmadığına oy birliğiyle karar verildi."},{"$f":"\"5.) İkinci bir karar alınıncaya kadar avans aidatlarının yapılan işletme projesinin oy birliği ile kabul edilmesiyle bağımsız bölüm başına \"&BV3&\".-TL/Ay toplanmasına karar verilmiştir.\"","v":"5.) İkinci bir karar alınıncaya kadar avans aidatlarının yapılan işletme projesinin oy birliği ile kabul edilmesiyle bağımsız bölüm başına .-TL/Ay toplanmasına karar verilmiştir."},"6.) Dilek ve temennilere gelindi apartmanımızın elektrik, su gibi giderlerinin Türkiyede yerleşik bir Bankada açılacak yönetim hesabından otomatik ödeme talimatlarıyla düzenli olarak yapılması hususlarına oy birliği ile karar verildi.","Kararlar oy birliği ile imza altına alınarak toplantı kapatıldı.","2016-01-15"]
[2,"1.)Kat Malikleri Kurulu , Yoklama Yapıldı Ve Gerekli Ekseriyetin Hazır Bulunduğu Tespit Edilerek Gündemin Görüşülmesi İçin Toplantı Divan Başkanlığına Murat Gücükdeli, Katipliğe Serap Gücükdeli Tüm Maliklerin Kabul Oy Birliği İle Seçildi.","2.) Yönetimin Yıllık Faaliyet Raporu İncelenip Gelir Ve Giderler Kabul Edip İbra Edildi.","3.)Denetici Raporu Okunup Kabul Edilip İbra Edildi.","4.) Divan Başkanı Tarafından Yönetici Adayı Olarak Profesyonel Bilgi Birikimi Bulunan Bilal Yılmaz Ve Yönetici Yardımcılığına/Yardımcılıklarına Halil Şahbaz   Zülfiye Şahbaz Önerildi. Denetici Olarak Fatih Toklucu Ve Denetici Yardımcılığına/Yardımcılıklarına Fatma Toklucu  Seher Toklucu   Selva Toklucu Önerildi. Konu Oylamaya Sunuldu. Yönetici Bilal Yılmaz Ve Yönetici Yardımcılığına/Yardımcılıklarına Halil Şahbaz   Zülfiye Şahbaz Ve Denetici Fatih Toklucu Ve Denetici Yardımcılığına Fatma Toklucu  Seher Toklucu   Selva Toklucu Olarak Seçilmesine Oy Birliği İle Karar Verildi.","Yönetici Bilal Yılmaz Ve Veya Denetici Fatih Toklucu'A Apartman/Site'Ye Ait Tüm Bankacılık İşlemlerini Yapmaya Ve Tüm Resmi Ve Özel Kurumlarda Binayı Münferiden Veya Ayrı Ayrı Temsil Etmesine Oy Birliği İle Karar Verilmiştir. Fatih Toklucu'A Apartmanın/Sitenin Avans Aidat Ve Yatırım Aylık Ödemelerinden Doğan Alacakları Hususunda Toplam Borcu 180.-Tl'Yi Geçen Maliklerin Avukat Kanalıyla İcra Takibi Yapılması Hususunda Bir Avukata Işıl-3 Apartmanı Adına Vekalet Vermesi Hususunda Yetki Verilmiştir.","Yönetici Bilal Yılmaz'A 150 Tl. Yönetim Huzur Hakkı Ödenmesine Karar Verildi. Deneticiye Bir Ücret Ödenmesine Gerek Olmadığına Oy Birliğiyle Karar Verildi.","5.) İkinci Bir Karar Alınıncaya Kadar Avans Aidatlarının Yapılan İşletme Projesinin Oy Birliği İle Kabul Edilmesiyle Bağımsız Bölüm Başına 15.-Tl/Ay Toplanmasına Karar Verilmiştir.","6.) Dilek Ve Temennilere Gelindi Apartmanımızın Elektrik, Su Gibi Giderlerinin Türkiyede Yerleşik Bir Bankada Açılacak Yönetim Hesabından Otomatik Ödeme Talimatlarıyla Düzenli Olarak Yapılması Hususlarına Oy Birliği İle Karar Verildi.","Kararlar Oy Birliği İle İmza Altına Alınarak Toplantı Kapatıldı.","15.04.2016"]

{"sheet":"NOTER","index":16,"n_rows":500,"n_cols":2,"rows_kept":500,"cut":false,"hidden":false,"merged":[]}
["Karar Defteri : ",1]
[{"$f":"IF(B2>0,A1,\"\")","v":"Karar Defteri : "},2]
[{"$f":"IF(B3>0,A2,\"\")","v":"Karar Defteri : "},3]
["Karar Defteri : ",4]
["Karar Defteri : ",5]
["Karar Defteri : ",6]
["Karar Defteri : ",7]
["Karar Defteri : ",8]
["Karar Defteri : ",9]
["Karar Defteri : ",10]
["Karar Defteri : ",11]
["Karar Defteri : ",12]
["Karar Defteri : ",13]
["Karar Defteri : ",14]
["Karar Defteri : ",15]
["Karar Defteri : ",16]
["Karar Defteri : ",17]
["Karar Defteri : ",18]
["Karar Defteri : ",19]
["Karar Defteri : ",20]
["Karar Defteri : ",21]
["Karar Defteri : ",22]
["Karar Defteri : ",23]
["Karar Defteri : ",24]
["Karar Defteri : ",25]
["Karar Defteri : ",26]
["Karar Defteri : ",27]
["Karar Defteri : ",28]
["Karar Defteri : ",29]
["Karar Defteri : ",30]
["Karar Defteri : ",31]
["Karar Defteri : ",32]
["Karar Defteri : ",33]
["Karar Defteri : ",34]
["Karar Defteri : ",35]
["Karar Defteri : ",36]
["Karar Defteri : ",37]
["Karar Defteri : ",38]
["Karar Defteri : ",39]
["Karar Defteri : ",40]
["Karar Defteri : ",41]
["Karar Defteri : ",42]
["Karar Defteri : ",43]
["Karar Defteri : ",44]
["Karar Defteri : ",45]
["Karar Defteri : ",46]
["Karar Defteri : ",47]
["Karar Defteri : ",48]
["Karar Defteri : ",49]
["Karar Defteri : ",50]
["Karar Defteri : ",51]
["Karar Defteri : ",52]
["Karar Defteri : ",53]
["Karar Defteri : ",54]
["Karar Defteri : ",55]
["Karar Defteri : ",56]
["Karar Defteri : ",57]
["Karar Defteri : ",58]
["Karar Defteri : ",59]
["Karar Defteri : ",60]
["Karar Defteri : ",61]
["Karar Defteri : ",62]
["Karar Defteri : ",63]
["Karar Defteri : ",64]
["Karar Defteri : ",65]
["Karar Defteri : ",66]
[{"$f":"IF(B67>0,A66,\"\")","v":"Karar Defteri : "},67]
["Karar Defteri : ",68]
["Karar Defteri : ",69]
["Karar Defteri : ",70]
["Karar Defteri : ",71]
["Karar Defteri : ",72]
["Karar Defteri : ",73]
["Karar Defteri : ",74]
["Karar Defteri : ",75]
["Karar Defteri : ",76]
["Karar Defteri : ",77]
["Karar Defteri : ",78]
["Karar Defteri : ",79]
["Karar Defteri : ",80]
["Karar Defteri : ",81]
["Karar Defteri : ",82]
["Karar Defteri : ",83]
["Karar Defteri : ",84]
["Karar Defteri : ",85]
["Karar Defteri : ",86]
["Karar Defteri : ",87]
["Karar Defteri : ",88]
["Karar Defteri : ",89]
["Karar Defteri : ",90]
["Karar Defteri : ",91]
["Karar Defteri : ",92]
["Karar Defteri : ",93]
["Karar Defteri : ",94]
["Karar Defteri : ",95]
["Karar Defteri : ",96]
["Karar Defteri : ",97]
["Karar Defteri : ",98]
["Karar Defteri : ",99]
["Karar Defteri : ",100]
["Karar Defteri : ",101]
["Karar Defteri : ",102]
["Karar Defteri : ",103]
["Karar Defteri : ",104]
["Karar Defteri : ",105]
["Karar Defteri : ",106]
["Karar Defteri : ",107]
["Karar Defteri : ",108]
["Karar Defteri : ",109]
["Karar Defteri : ",110]
["Karar Defteri : ",111]
["Karar Defteri : ",112]
["Karar Defteri : ",113]
["Karar Defteri : ",114]
["Karar Defteri : ",115]
["Karar Defteri : ",116]
["Karar Defteri : ",117]
["Karar Defteri : ",118]
["Karar Defteri : ",119]
["Karar Defteri : ",120]
["Karar Defteri : ",121]
["Karar Defteri : ",122]
["Karar Defteri : ",123]
["Karar Defteri : ",124]
["Karar Defteri : ",125]
["Karar Defteri : ",126]
["Karar Defteri : ",127]
["Karar Defteri : ",128]
["Karar Defteri : ",129]
["Karar Defteri : ",130]
[{"$f":"IF(B131>0,A130,\"\")","v":"Karar Defteri : "},131]
["Karar Defteri : ",132]
["Karar Defteri : ",133]
["Karar Defteri : ",134]
["Karar Defteri : ",135]
["Karar Defteri : ",136]
["Karar Defteri : ",137]
["Karar Defteri : ",138]
["Karar Defteri : ",139]
["Karar Defteri : ",140]
["Karar Defteri : ",141]
["Karar Defteri : ",142]
["Karar Defteri : ",143]
["Karar Defteri : ",144]
["Karar Defteri : ",145]
["Karar Defteri : ",146]
["Karar Defteri : ",147]
["Karar Defteri : ",148]
["Karar Defteri : ",149]
["Karar Defteri : ",150]
["Karar Defteri : ",151]
["Karar Defteri : ",152]
["Karar Defteri : ",153]
["Karar Defteri : ",154]
["Karar Defteri : ",155]
["Karar Defteri : ",156]
["Karar Defteri : ",157]
["Karar Defteri : ",158]
["Karar Defteri : ",159]
["Karar Defteri : ",160]
["Karar Defteri : ",161]
["Karar Defteri : ",162]
["Karar Defteri : ",163]
["Karar Defteri : ",164]
["Karar Defteri : ",165]
["Karar Defteri : ",166]
["Karar Defteri : ",167]
["Karar Defteri : ",168]
["Karar Defteri : ",169]
["Karar Defteri : ",170]
["Karar Defteri : ",171]
["Karar Defteri : ",172]
["Karar Defteri : ",173]
["Karar Defteri : ",174]
["Karar Defteri : ",175]
["Karar Defteri : ",176]
["Karar Defteri : ",177]
["Karar Defteri : ",178]
["Karar Defteri : ",179]
["Karar Defteri : ",180]
["Karar Defteri : ",181]
["Karar Defteri : ",182]
["Karar Defteri : ",183]
["Karar Defteri : ",184]
["Karar Defteri : ",185]
["Karar Defteri : ",186]
["Karar Defteri : ",187]
["Karar Defteri : ",188]
["Karar Defteri : ",189]
["Karar Defteri : ",190]
["Karar Defteri : ",191]
["Karar Defteri : ",192]
["Karar Defteri : ",193]
["Karar Defteri : ",194]
[{"$f":"IF(B195>0,A194,\"\")","v":"Karar Defteri : "},195]
["Karar Defteri : ",196]
["Karar Defteri : ",197]
["Karar Defteri : ",198]
["Karar Defteri : ",199]
["Karar Defteri : ",200]
["Karar Defteri : ",201]
["Karar Defteri : ",202]
["Karar Defteri : ",203]
["Karar Defteri : ",204]
["Karar Defteri : ",205]
["Karar Defteri : ",206]
["Karar Defteri : ",207]
["Karar Defteri : ",208]
["Karar Defteri : ",209]
["Karar Defteri : ",210]
["Karar Defteri : ",211]
["Karar Defteri : ",212]
["Karar Defteri : ",213]
["Karar Defteri : ",214]
["Karar Defteri : ",215]
["Karar Defteri : ",216]
["Karar Defteri : ",217]
["Karar Defteri : ",218]
["Karar Defteri : ",219]
["Karar Defteri : ",220]
["Karar Defteri : ",221]
["Karar Defteri : ",222]
["Karar Defteri : ",223]
["Karar Defteri : ",224]
["Karar Defteri : ",225]
["Karar Defteri : ",226]
["Karar Defteri : ",227]
["Karar Defteri : ",228]
["Karar Defteri : ",229]
["Karar Defteri : ",230]
["Karar Defteri : ",231]
["Karar Defteri : ",232]
["Karar Defteri : ",233]
["Karar Defteri : ",234]
["Karar Defteri : ",235]
["Karar Defteri : ",236]
["Karar Defteri : ",237]
["Karar Defteri : ",238]
["Karar Defteri : ",239]
["Karar Defteri : ",240]
["Karar Defteri : ",241]
["Karar Defteri : ",242]
["Karar Defteri : ",243]
["Karar Defteri : ",244]
["Karar Defteri : ",245]
["Karar Defteri : ",246]
["Karar Defteri : ",247]
["Karar Defteri : ",248]
["Karar Defteri : ",249]
["Karar Defteri : ",250]
["Karar Defteri : ",251]
["Karar Defteri : ",252]
["Karar Defteri : ",253]
["Karar Defteri : ",254]
["Karar Defteri : ",255]
["Karar Defteri : ",256]
["Karar Defteri : ",257]
["Karar Defteri : ",258]
[{"$f":"IF(B259>0,A258,\"\")","v":"Karar Defteri : "},259]
["Karar Defteri : ",260]
["Karar Defteri : ",261]
["Karar Defteri : ",262]
["Karar Defteri : ",263]
["Karar Defteri : ",264]
["Karar Defteri : ",265]
["Karar Defteri : ",266]
["Karar Defteri : ",267]
["Karar Defteri : ",268]
["Karar Defteri : ",269]
["Karar Defteri : ",270]
["Karar Defteri : ",271]
["Karar Defteri : ",272]
["Karar Defteri : ",273]
["Karar Defteri : ",274]
["Karar Defteri : ",275]
["Karar Defteri : ",276]
["Karar Defteri : ",277]
["Karar Defteri : ",278]
["Karar Defteri : ",279]
["Karar Defteri : ",280]
["Karar Defteri : ",281]
["Karar Defteri : ",282]
["Karar Defteri : ",283]
["Karar Defteri : ",284]
["Karar Defteri : ",285]
["Karar Defteri : ",286]
["Karar Defteri : ",287]
["Karar Defteri : ",288]
["Karar Defteri : ",289]
["Karar Defteri : ",290]
["Karar Defteri : ",291]
["Karar Defteri : ",292]
["Karar Defteri : ",293]
["Karar Defteri : ",294]
["Karar Defteri : ",295]
["Karar Defteri : ",296]
["Karar Defteri : ",297]
["Karar Defteri : ",298]
["Karar Defteri : ",299]
["Karar Defteri : ",300]
["Karar Defteri : ",301]
["Karar Defteri : ",302]
["Karar Defteri : ",303]
["Karar Defteri : ",304]
["Karar Defteri : ",305]
["Karar Defteri : ",306]
["Karar Defteri : ",307]
["Karar Defteri : ",308]
["Karar Defteri : ",309]
["Karar Defteri : ",310]
["Karar Defteri : ",311]
["Karar Defteri : ",312]
["Karar Defteri : ",313]
["Karar Defteri : ",314]
["Karar Defteri : ",315]
["Karar Defteri : ",316]
["Karar Defteri : ",317]
["Karar Defteri : ",318]
["Karar Defteri : ",319]
["Karar Defteri : ",320]
["Karar Defteri : ",321]
["Karar Defteri : ",322]
[{"$f":"IF(B323>0,A322,\"\")","v":"Karar Defteri : "},323]
["Karar Defteri : ",324]
["Karar Defteri : ",325]
["Karar Defteri : ",326]
["Karar Defteri : ",327]
["Karar Defteri : ",328]
["Karar Defteri : ",329]
["Karar Defteri : ",330]
["Karar Defteri : ",331]
["Karar Defteri : ",332]
["Karar Defteri : ",333]
["Karar Defteri : ",334]
["Karar Defteri : ",335]
["Karar Defteri : ",336]
["Karar Defteri : ",337]
["Karar Defteri : ",338]
["Karar Defteri : ",339]
["Karar Defteri : ",340]
["Karar Defteri : ",341]
["Karar Defteri : ",342]
["Karar Defteri : ",343]
["Karar Defteri : ",344]
["Karar Defteri : ",345]
["Karar Defteri : ",346]
["Karar Defteri : ",347]
["Karar Defteri : ",348]
["Karar Defteri : ",349]
["Karar Defteri : ",350]
["Karar Defteri : ",351]
["Karar Defteri : ",352]
["Karar Defteri : ",353]
["Karar Defteri : ",354]
["Karar Defteri : ",355]
["Karar Defteri : ",356]
["Karar Defteri : ",357]
["Karar Defteri : ",358]
["Karar Defteri : ",359]
["Karar Defteri : ",360]
["Karar Defteri : ",361]
["Karar Defteri : ",362]
["Karar Defteri : ",363]
["Karar Defteri : ",364]
["Karar Defteri : ",365]
["Karar Defteri : ",366]
["Karar Defteri : ",367]
["Karar Defteri : ",368]
["Karar Defteri : ",369]
["Karar Defteri : ",370]
["Karar Defteri : ",371]
["Karar Defteri : ",372]
["Karar Defteri : ",373]
["Karar Defteri : ",374]
["Karar Defteri : ",375]
["Karar Defteri : ",376]
["Karar Defteri : ",377]
["Karar Defteri : ",378]
["Karar Defteri : ",379]
["Karar Defteri : ",380]
["Karar Defteri : ",381]
["Karar Defteri : ",382]
["Karar Defteri : ",383]
["Karar Defteri : ",384]
["Karar Defteri : ",385]
["Karar Defteri : ",386]
[{"$f":"IF(B387>0,A386,\"\")","v":"Karar Defteri : "},387]
["Karar Defteri : ",388]
["Karar Defteri : ",389]
["Karar Defteri : ",390]
["Karar Defteri : ",391]
["Karar Defteri : ",392]
["Karar Defteri : ",393]
["Karar Defteri : ",394]
["Karar Defteri : ",395]
["Karar Defteri : ",396]
["Karar Defteri : ",397]
["Karar Defteri : ",398]
["Karar Defteri : ",399]
["Karar Defteri : ",400]
["Karar Defteri : ",401]
["Karar Defteri : ",402]
["Karar Defteri : ",403]
["Karar Defteri : ",404]
["Karar Defteri : ",405]
["Karar Defteri : ",406]
["Karar Defteri : ",407]
["Karar Defteri : ",408]
["Karar Defteri : ",409]
["Karar Defteri : ",410]
["Karar Defteri : ",411]
["Karar Defteri : ",412]
["Karar Defteri : ",413]
["Karar Defteri : ",414]
["Karar Defteri : ",415]
["Karar Defteri : ",416]
["Karar Defteri : ",417]
["Karar Defteri : ",418]
["Karar Defteri : ",419]
["Karar Defteri : ",420]
["Karar Defteri : ",421]
["Karar Defteri : ",422]
["Karar Defteri : ",423]
["Karar Defteri : ",424]
["Karar Defteri : ",425]
["Karar Defteri : ",426]
["Karar Defteri : ",427]
["Karar Defteri : ",428]
["Karar Defteri : ",429]
["Karar Defteri : ",430]
["Karar Defteri : ",431]
["Karar Defteri : ",432]
["Karar Defteri : ",433]
["Karar Defteri : ",434]
["Karar Defteri : ",435]
["Karar Defteri : ",436]
["Karar Defteri : ",437]
["Karar Defteri : ",438]
["Karar Defteri : ",439]
["Karar Defteri : ",440]
["Karar Defteri : ",441]
["Karar Defteri : ",442]
["Karar Defteri : ",443]
["Karar Defteri : ",444]
["Karar Defteri : ",445]
["Karar Defteri : ",446]
["Karar Defteri : ",447]
["Karar Defteri : ",448]
["Karar Defteri : ",449]
["Karar Defteri : ",450]
[{"$f":"IF(B451>0,A450,\"\")","v":"Karar Defteri : "},451]
["Karar Defteri : ",452]
["Karar Defteri : ",453]
["Karar Defteri : ",454]
["Karar Defteri : ",455]
["Karar Defteri : ",456]
["Karar Defteri : ",457]
["Karar Defteri : ",458]
["Karar Defteri : ",459]
["Karar Defteri : ",460]
["Karar Defteri : ",461]
["Karar Defteri : ",462]
["Karar Defteri : ",463]
["Karar Defteri : ",464]
["Karar Defteri : ",465]
["Karar Defteri : ",466]
["Karar Defteri : ",467]
["Karar Defteri : ",468]
["Karar Defteri : ",469]
["Karar Defteri : ",470]
["Karar Defteri : ",471]
["Karar Defteri : ",472]
["Karar Defteri : ",473]
["Karar Defteri : ",474]
["Karar Defteri : ",475]
["Karar Defteri : ",476]
["Karar Defteri : ",477]
["Karar Defteri : ",478]
["Karar Defteri : ",479]
["Karar Defteri : ",480]
["Karar Defteri : ",481]
["Karar Defteri : ",482]
["Karar Defteri : ",483]
["Karar Defteri : ",484]
["Karar Defteri : ",485]
["Karar Defteri : ",486]
["Karar Defteri : ",487]
["Karar Defteri : ",488]
["Karar Defteri : ",489]
["Karar Defteri : ",490]
["Karar Defteri : ",491]
["Karar Defteri : ",492]
["Karar Defteri : ",493]
["Karar Defteri : ",494]
["Karar Defteri : ",495]
["Karar Defteri : ",496]
["Karar Defteri : ",497]
["Karar Defteri : ",498]
["Karar Defteri : ",499]
["Karar Defteri : ",500]